{"text_format":"1","workbook":"xlsx","n_sheets":10,"sheets":["確認事項","実行","チェック表","START","END","LOOP","COMMENT","List","WOL","obs_sequence"],"not_rendered":{"charts":0,"images":0,"macros":1,"external_links":0,"defined_names":5,"comments":0,"pivot_tables":0},"unopened":[],"bounds":{"document_bytes":16777216,"sheet_cells":100000,"rows_first":2000,"rows_last":500,"rows_between":2000,"halvings":0,"cell_chars":16384,"cell_head_chars":4096},"cells_cut":0,"cells_raw":0,"read":"whole","date_system":"1900"}

{"sheet":"確認事項","index":0,"n_rows":1,"n_cols":4,"rows_kept":1,"cut":false,"hidden":false,"merged":[]}
["NO.","確認事項","回答","CLOSE"]

{"sheet":"実行","index":1,"n_rows":16,"n_cols":6,"rows_kept":16,"cut":false,"hidden":true,"merged":[]}
[]
[]
[]
[]
[]
[]
[]
[null,null,null,null,null,"【操作】"]
["C番号",977,null,null,null,"「実行」シートの「観測作成」を押下。"]
["M番号",630701,null,null,null,"→「START」、「LOOP」、「END」を「obs_sequence」に貼り付けます。"]
[null,null,null,null,null,"「実行」シートの「時刻反映」を押下。"]
[null,null,null,null,null,"→WOLの時間と関数エラーとなっているセルを修正します。"]
[null,null,null,null,null,"【注意点】"]
[null,null,null,null,null,"「START」、「LOOP」、「END」の\"cmd count\"からシート内に何行あるかを取得しているので、ここは空白がないように\"0”を入力してください。"]
[null,null,null,null,null,"もし空白があった場合、コピー範囲が小さくなってしまいます。"]
[null,null,null,null,null,"”WOL”シートの4行目以下は、実施するWOLのみを記載すること。\n(4行目以下に、期間開始日時と終了日時の記載は不要です。)"]

{"sheet":"チェック表","index":2,"n_rows":19,"n_cols":4,"rows_kept":19,"cut":false,"hidden":true,"merged":[]}
[]
[null,"コマンド作成時注意項目"]
[null,"NO.","項目","チェック"]
[null,1,"\n観測期間開始時に「dcsm-EF_BUS_MONI_ON」手順が入っていることを確認する。\nただし、前回の観測終了時に「dcsm-EF_BUS_MONI_OFF」を実行していない場合は確認不要。\n","□"]
[null,2,"\n観測期間開始日に、観測する機器の”ON”手順が入っていることを確認する。\nただし、PWI、MGF、MAST、WPTを\"ON\"にする場合は、PWI、MGF、MAST、WPTよりも先にPMEが\"ON\"となっていること。\n※クルーズ観測中は、MEA1,HEPE,MGFのみ”ON”\n","□"]
[null,3,"\nTLM MODEが観測前に「５」　観測終了後は「１０」　となっていることを確認する\n","□"]
[null,4,"\n観測時間が”86400”を超えるていないか確認する。\n超えていた場合は、main計画作成時に途中ダミーコマンドを挿入すること\n"]
[null,5,"WOLの開始時刻が正しいことを確認する","□"]
[null,6,"\nWOLの時間を確認　HV　OFFになっていることを確認する\n↓\nクルーズ観測を行っている機器(HEPE、ENA、MIA、MEA、MSAのみ)\nフライバイを行っている機器(MSA,PWI,MGF,MEA,ENA,MIA,HEPE,MDM)\n","□"]
[null,7,"\nWOL終了時刻＋10以降にのHVがONになっていることを確認する。\nクルーズ観測を行っている機器(HEPE、ENA、MIA、MEA、MSAのみ)\nフライバイを行っている機器(MSA,PWI,MGF,MEA,ENA,MIA,HEPE,MDM)\n","□"]
[null,8,"\n観測期間最終日に、観測を行った機器の”OFF”手順が入っていることを確認する。\nただし、PWI,MGF,MAST,WPT-OFF手順の後にPME-OFF手順が入っていることを確認する。\n","□"]
[null,9,"\nMDP_POWEROFFのあとにdcsm-MC_ENA_MDPが入っていることを確認する。\n","□"]
[null,10,"\nCELのMONI ONは長時間(1h以上の場合は、山下さんと要相談)しないこと　\nBUSにはCELのみのもあるので注意　dcsm-BUS_CEL_MONI_ON　dcsm-BUS_CEL_MONI_OFF\n","□"]
[null,11,"MEA1の  SCAN ON は　dcsm-EF_MEA1_ON_SW.cpsに入っているので\n　　　順番は　MDP ONして\n　　　　　　　dcsm-EF_MEA1_ON_SW.cps\n　　　　　　　dcsm-EF_MEA1_HV_ON.cps\n　　　　　　　dcsm-EF_MEA1_HV_OFF.cps\n　　　　　　　dcsm-EF_MEA1_HV_ON.cps\n　　　　　　　dcsm-EF_MEA1_HV_SCAN_OFF.cps\n　　　　　　　dcsm-EF_MEA1_OFF.cps\n　　　　　　　MDP　OFF\n　　　　　　　\n  　　　　　　dcsm-EF_MEA_ON_SW.cps\n　　　　　　　dcsm-EF_MEA_HV_ON.cps\n　　　　　　　dcsm-EF_MEA_HV_OFF.cps\n　　　　　　　dcsm-EF_MEA_HV_ON.cps\n　　　　　　　dcsm-EF_MEA_HV_SCAN_OFF.cps\n　　　　　　　dcsm-EF_MEA_OFF.cps\n\n　　　になる\n　SCAN OFFにすると　データが出てこない　HV OFF->ON時は注意する","□"]
[null,13,"2021/6/25以降　dcsm-EF_MSA_ON_C　が最新　dcsm-EF_MSA_ONは使用しない","□"]
[null,14,"2021/6/25以降　dcsm-CRCO_MIA_CHECK_C　が最新　dcsm-CRCO_MIA_CHECKは使用しない（クルーズチェックアウトの時）","□"]
[null,15,"2021/6/25以降　dcsm-CRCO_MSA_CHECK_C　が最新　dcsm-CRCO_MSA_CHECKは使用しない（クルーズチェックアウトの時）","□"]
[null,16,"フライバイ時、MIAのHV_ON時間帯によって違うので必ず確認する\nMIA_HV_ON_RC\nMIA_HV_ON_SW_RC\nMIA_HV_ON_MAG_RC","□"]
[null,17,"Excelの時間を確認する　時間通りになっているか","□"]

{"sheet":"START","index":3,"n_rows":9,"n_cols":21,"rows_kept":9,"cut":false,"hidden":true,"merged":[[5,5,8,5]]}
["Start","End","Start","End","Event","Activity","Procedure","Duration (sec)",null,null,null,"cmd count",null,"cmd count"]
[null,null,{"$f":"#REF!","v":{"$error":"#REF!"}},{"$f":"C2+H2/3600/24","v":{"$error":"#REF!"}},null,"BUS_ON","BUS_SETUP_D",{"$f":"VLOOKUP(G2,List!B:C,2,0)","v":577},null,null,{"$f":"VLOOKUP(G2,List!B:E,4,0)","v":"dcsm-EF_BUS_MONI_ON"},{"$f":"VLOOKUP(G2,List!B:G,6,0)","v":20},null,{"$f":"+\"0000    CALL \"&K2&\" -Run\"","v":"0000    CALL dcsm-EF_BUS_MONI_ON -Run"},null,"CALL","dcsm-EF_BUS_MONI_ON",null,null,null,{"$f":"+IF(Q2=K2,\"\",\"x\")","v":""}]
[null,null,{"$f":"+D2","v":{"$error":"#REF!"}},{"$f":"C3+H3/3600/24","v":{"$error":"#REF!"}},null,"MDP ON","MDP_ON_D",{"$f":"VLOOKUP(G3,List!B:C,2,0)","v":509},null,null,{"$f":"VLOOKUP(G3,List!B:E,4,0)","v":"dcsm-EF_MDP_ON"},{"$f":"VLOOKUP(G3,List!B:G,6,0)","v":11},null,{"$f":"+\"0000    CALL \"&K3&\" -Run\"","v":"0000    CALL dcsm-EF_MDP_ON -Run"},null,"CALL","dcsm-EF_MDP_ON",null,null,null,{"$f":"+IF(Q3=K3,\"\",\"x\")","v":""}]
[null,null,{"$f":"D3","v":{"$error":"#REF!"}},{"$f":"C4+H4/3600/24","v":{"$error":"#REF!"}},null,null,"MDP_CRUISE_SET",{"$f":"VLOOKUP(G4,List!B:C,2,0)","v":42},null,null,{"$f":"VLOOKUP(G4,List!B:E,4,0)","v":"dcsm-EF_MDP_CRUISE_SET"},{"$f":"VLOOKUP(G4,List!B:G,6,0)","v":2},null,"0000    CALL dcsm-EF_MDP_CRUISE_SET -Run"]
[null,null,{"$f":"D4","v":{"$error":"#REF!"}},{"$error":"#REF!"},null,"TLM mode change (MODE_10)","TLM_MODE_10",{"$f":"VLOOKUP(G5,List!B:C,2,0)","v":42},null,null,{"$f":"VLOOKUP(G5,List!B:E,4,0)","v":"dcsm-EF_BUS_TLM_MODE_10"},{"$f":"VLOOKUP(G5,List!B:G,6,0)","v":2},null,"0000    CALL dcsm-EF_BUS_TLM_MODE_10 -Run"]
[null,null,{"$error":"#REF!"},{"$error":"#REF!"},null,"SI Power ON","MEA1_ON_SETUP_SW",{"$f":"VLOOKUP(G6,List!B:C,2,0)","v":292},null,null,{"$f":"VLOOKUP(G6,List!B:E,4,0)","v":"dcsm-EF_MEA1_ON_SW"},{"$f":"VLOOKUP(G6,List!B:G,6,0)","v":12},null,"0000    CALL dcsm-EF_MEA1_ON_SW -Run"]
[null,null,{"$error":"#REF!"},{"$error":"#REF!"},null,null,"HEP_ON_SETUP",{"$f":"VLOOKUP(G7,List!B:C,2,0)","v":1230},null,null,{"$f":"VLOOKUP(G7,List!B:E,4,0)","v":"dcsm-EF_HEP_ON_START_for_TL"},{"$f":"VLOOKUP(G7,List!B:G,6,0)","v":34},null,"0000    CALL dcsm-EF_HEP_ON_START_for_TL -Run",null,"CALL","dcsm-EF_MDP_CRUISE_SET",null,null,null,"x"]
[null,null,{"$error":"#REF!"},{"$error":"#REF!"},null,null,"PME_ON",{"$f":"VLOOKUP(G8,List!B:C,2,0)","v":80},null,null,{"$f":"VLOOKUP(G8,List!B:E,4,0)","v":"dcsm-EF_PME_ON"},{"$f":"VLOOKUP(G8,List!B:G,6,0)","v":2},null,"0000    CALL dcsm-EF_PME_ON -Run",null,"CALL","dcsm-EF_BUS_TLM_MODE_10",null,null,null,"x"]
[null,null,{"$error":"#REF!"},{"$error":"#REF!"},null,null,"MGF_ON_SETUP",{"$f":"VLOOKUP(G9,List!B:C,2,0)","v":14},null,null,{"$f":"VLOOKUP(G9,List!B:E,4,0)","v":"dcsm-EF_MGF_ON"},{"$f":"VLOOKUP(G9,List!B:G,6,0)","v":3},null,"0000    CALL dcsm-EF_MGF_ON -Run"]

{"sheet":"END","index":4,"n_rows":9,"n_cols":21,"rows_kept":9,"cut":false,"hidden":true,"merged":[[1,5,4,5]]}
["Start","End","Start","End","Event","Activity","Procedure","Duration (sec)",null,null,null,"cmd count",null,"cmd count"]
[null,null,{"$f":"D2-H2/3600/24","v":{"$error":"#REF!"}},{"$f":"C3","v":{"$error":"#REF!"}},null,"SI OFF","HEP_OFF",{"$f":"VLOOKUP(G2,List!B:C,2,0)","v":70},null,null,{"$f":"VLOOKUP(G2,List!B:E,4,0)","v":"dcsm-EF_HEPE_OFF_STOP"},{"$f":"VLOOKUP(G2,List!B:G,6,0)","v":4},null,{"$f":"+\"0000    CALL \"&K2&\" -Run\"","v":"0000    CALL dcsm-EF_HEPE_OFF_STOP -Run"},null,"CALL","dcsm-EF_HEPE_OFF_STOP",null,null,null,{"$f":"+IF(Q2=K2,\"\",\"x\")","v":""}]
[null,null,{"$error":"#REF!"},{"$error":"#REF!"},null,null,"MEA1_OFF",{"$f":"VLOOKUP(G3,List!B:C,2,0)","v":160},null,null,{"$f":"VLOOKUP(G3,List!B:E,4,0)","v":"dcsm-EF_MEA1_OFF"},{"$f":"VLOOKUP(G3,List!B:G,6,0)","v":4},null,{"$f":"+\"0000    CALL \"&K3&\" -Run\"","v":"0000    CALL dcsm-EF_MEA1_OFF -Run"},null,"CALL","dcsm-EF_MEA1_OFF",null,null,null,""]
[null,null,{"$error":"#REF!"},{"$error":"#REF!"},null,null,"MGF_OFF",{"$f":"VLOOKUP(G4,List!B:C,2,0)","v":8},null,null,{"$f":"VLOOKUP(G4,List!B:E,4,0)","v":"dcsm-EF_MGF_OFF"},{"$f":"VLOOKUP(G4,List!B:G,6,0)","v":1},null,"0000    CALL dcsm-EF_MGF_OFF -Run",null,"CALL","dcsm-EF_MGF_OFF",null,null,null,""]
[null,null,{"$error":"#REF!"},{"$error":"#REF!"},null,null,"PME_OFF",{"$f":"VLOOKUP(G5,List!B:C,2,0)","v":40},null,null,{"$f":"VLOOKUP(G5,List!B:E,4,0)","v":"dcsm-EF_PME_OFF"},{"$f":"VLOOKUP(G5,List!B:G,6,0)","v":1},null,"0000    CALL dcsm-EF_PME_OFF -Run",null,"CALL","dcsm-EF_PME_OFF",null,null,null,""]
[null,null,{"$error":"#REF!"},{"$error":"#REF!"},null,"MDP OFF","MDP_OFF_D",{"$f":"VLOOKUP(G6,List!B:C,2,0)","v":120},null,null,{"$f":"VLOOKUP(G6,List!B:E,4,0)","v":"dcsm-EF_MDP_POWEROFF"},{"$f":"VLOOKUP(G6,List!B:G,6,0)","v":3},null,"0000    CALL dcsm-EF_MDP_POWEROFF -Run",null,"CALL","dcsm-EF_MDP_POWEROFF",null,null,null,""]
[null,null,{"$error":"#REF!"},{"$error":"#REF!"},null,"MACRO ENA","MC_ENA",{"$f":"VLOOKUP(G7,List!B:C,2,0)","v":246},null,null,{"$f":"VLOOKUP(G7,List!B:E,4,0)","v":"dcsm-MC_ENA_MDP"},{"$f":"VLOOKUP(G7,List!B:G,6,0)","v":21},null,"0000    CALL dcsm-MC_ENA_MDP -Run",null,"CALL","dcsm-MC_ENA_MDP",null,null,null,""]
[null,null,{"$error":"#REF!"},{"$f":"C9","v":{"$error":"#REF!"}},null,"BUS OFF","BUS_OFF_D",{"$f":"VLOOKUP(G8,List!B:C,2,0)","v":220},null,null,{"$f":"VLOOKUP(G8,List!B:E,4,0)","v":"dcsm-EF_BUS_MONI_OFF"},{"$f":"VLOOKUP(G8,List!B:G,6,0)","v":5},null,"0000    CALL dcsm-EF_BUS_MONI_OFF -Run",null,null,null,null,null,null,{"$f":"+IF(Q7=K8,\"\",\"x\")","v":"x"}]
[null,null,{"$f":"#REF!","v":{"$error":"#REF!"}},{"$f":"C9+H9/3600/24","v":{"$error":"#REF!"}},{"$f":"#REF!","v":{"$error":"#REF!"}},null,"END",1200,null,null,{"$f":"VLOOKUP(G9,List!B:E,4,0)","v":{"$error":"#N/A"}},0]

{"sheet":"LOOP","index":5,"n_rows":9,"n_cols":21,"rows_kept":9,"cut":false,"hidden":true,"merged":[[1,5,2,5],[6,5,7,5]]}
["Start","End","Start","End","Event","Activity","Procedure","Duration (sec)",null,null,null,"cmd count",null,"cmd count"]
[null,null,{"$f":"D1","v":"End"},{"$f":"C2+H2/3600/24","v":{"$error":"#VALUE!"}},null,"SI HV ON","MEA1_HV_ON",{"$f":"VLOOKUP(G2,List!B:C,2,0)","v":1702},null,null,{"$f":"VLOOKUP(G2,List!B:E,4,0)","v":"dcsm-EF_MEA1_HV_ON"},{"$f":"VLOOKUP(G2,List!B:G,6,0)","v":27},null,{"$f":"+\"0000    CALL \"&K2&\" -Run\"","v":"0000    CALL dcsm-EF_MEA1_HV_ON -Run"},null,"CALL","dcsm-EF_MEA1_HV_ON",null,null,null,{"$f":"+IF(Q2=K2,\"\",\"x\")","v":""}]
[null,null,{"$error":"#VALUE!"},{"$error":"#VALUE!"},null,null,"HEP_HV_ON",{"$f":"VLOOKUP(G3,List!B:C,2,0)","v":270},null,null,{"$f":"VLOOKUP(G3,List!B:E,4,0)","v":"dcsm-EF_HEPE_HV_ON_OBS_START"},{"$f":"VLOOKUP(G3,List!B:G,6,0)","v":6},null,{"$f":"+\"0000    CALL \"&K3&\" -Run\"","v":"0000    CALL dcsm-EF_HEPE_HV_ON_OBS_START -Run"},null,"CALL","dcsm-EF_HEPE_HV_ON_OBS_START",null,null,null,""]
[null,null,{"$error":"#VALUE!"},{"$error":"#VALUE!"},null,"TLM mode change (MODE_5)","TLM_MODE_5",{"$f":"VLOOKUP(G4,List!B:C,2,0)","v":42},"Mission: 7kbps, without user HK",null,{"$f":"VLOOKUP(G4,List!B:E,4,0)","v":"dcsm-EF_BUS_TLM_MODE_5"},{"$f":"VLOOKUP(G4,List!B:G,6,0)","v":2},null,"0000    CALL dcsm-EF_BUS_TLM_MODE_5 -Run",null,"CALL","dcsm-EF_BUS_TLM_MODE_5",null,null,null,""]
[null,null,{"$error":"#VALUE!"},{"$f":"C6","v":{"$error":"#REF!"}},"Observation A",null,null,{"$f":"(D5-C5)*3600*24","v":{"$error":"#REF!"}},{"$f":"H5/3600","v":{"$error":"#REF!"}},null,"",0,null,{"$f":"\"0000    WAIT_SEC  \"&TEXT(H5,\"#0\")","v":{"$error":"#REF!"}},null,"WAIT_SEC",26900,null,null,null,"x"]
[null,null,{"$f":"D6-H6/3600/24","v":{"$error":"#REF!"}},{"$f":"C7","v":{"$error":"#REF!"}},null,"TLM mode change (MODE_10)","TLM_MODE_10",{"$f":"VLOOKUP(G6,List!B:C,2,0)","v":42},"Mission: 4kbps, with user HK",null,{"$f":"VLOOKUP(G6,List!B:E,4,0)","v":"dcsm-EF_BUS_TLM_MODE_10"},{"$f":"VLOOKUP(G6,List!B:G,6,0)","v":2},null,"0000    CALL dcsm-EF_BUS_TLM_MODE_10 -Run",null,"CALL","dcsm-EF_BUS_TLM_MODE_10",null,null,null,""]
[null,null,{"$f":"D7-H7/3600/24","v":{"$error":"#REF!"}},{"$f":"C8","v":{"$error":"#REF!"}},null,"SI HV OFF","HEP_HV_OFF",{"$f":"VLOOKUP(G7,List!B:C,2,0)","v":190},null,null,{"$f":"VLOOKUP(G7,List!B:E,4,0)","v":"dcsm-EF_HEPE_HV_OFF_OBS_OFF"},{"$f":"VLOOKUP(G7,List!B:G,6,0)","v":5},null,"0000    CALL dcsm-EF_HEPE_HV_OFF_OBS_OFF -Run",null,"CALL","dcsm-EF_HEPE_HV_OFF_OBS_OFF",null,null,null,""]
[null,null,{"$f":"D8-H8/3600/24","v":{"$error":"#REF!"}},{"$f":"C9","v":{"$error":"#REF!"}},null,null,"MEA1_HV_OFF",{"$f":"VLOOKUP(G8,List!B:C,2,0)","v":182},null,null,{"$f":"VLOOKUP(G8,List!B:E,4,0)","v":"dcsm-EF_MEA1_HV_OFF"},{"$f":"VLOOKUP(G8,List!B:G,6,0)","v":10},null,"0000    CALL dcsm-EF_MEA1_HV_OFF -Run",null,"CALL","dcsm-EF_MEA1_HV_OFF",null,null,null,""]
[null,null,{"$f":"#REF!","v":{"$error":"#REF!"}},{"$f":"C9+H9/3600/24","v":{"$error":"#REF!"}},"WOL",null,{"$f":"(#REF!-D8)*24*3600","v":{"$error":"#REF!"}},1200,null,null,{"$f":"VLOOKUP(G9,List!B:E,4,0)","v":{"$error":"#REF!"}},0,null,{"$f":"\"0000    WAIT_SEC  \"&TEXT(G9,\"#0\")","v":{"$error":"#REF!"}},null,"WAIT_SEC",1800,null,null,null,{"$error":"#REF!"}]

{"sheet":"COMMENT","index":6,"n_rows":19,"n_cols":2,"rows_kept":19,"cut":false,"hidden":true,"merged":[]}
["activity","Comment"]
["main_start","#!HEAD: main2-CROUSE_OBS6_XDOR_001_M63 2021-07-01 01:18:36 478        45 MMO                  MAIN2               // Earth Fly-by                \n0001  . # LET                  @ONERR=NEXT                   \n0002  . # ==========================================================================\n0003    #  <startTime>2021-07-06T08:00:00Z</startTime>\n0004    #  <stopTime>2021-07-15T10:00:00Z</stopTime>\n0005    #  << XDOR:XDOR_BJXR_C%%%_CRCO_M&&&&&&_00001.BC >> 連続送信*****\n0006    #  << XOR:XOR__BJXR_C%%%_CRCO_M&&&&&&_00001.BC >> *****\n0007    # ==========================================================================\n0008    # ==========================================================================\n0009  . #  EXEC_AT 2021-07-06 08:00:00\n0010    # ◆◇◆◇◆◇◆◇◆◇◆◇◆◇◆◇◆◇◆◇◆◇◆◇◆◇◆◇◆◇◆◇◆◇◆◇◆"]
["main_end","0291    #############################################################################\n0292    # =========================================================================="]
["OBS","0068    # ==========================================================================\n0069    # @@. Observation \\\\\n0070    # ==========================================================================\n0071    #"]
["WOL","0217    # ==========================================================================\n0218    # @@. WOL # $$\n0219    # ==========================================================================\n0220    #"]
["BUS_ON","0016    # ==========================================================================\n0017    # @@. BUS ON \n0018    # ==========================================================================\n0019    #"]
["MDP ON","0020    # ==========================================================================\n0021    # @@. MDP ON\n0022    # ==========================================================================\n0023    #"]
["SI Check"]
["MDP OFF","0274    # ==========================================================================\n0275    # @@. MDP OFF\n0276    # ==========================================================================\n0277    #"]
["BUS OFF","0285    # ==========================================================================\n0286    # @@. BUS MONI OFF\n0287    # ==========================================================================\n0288    #"]
["SI Power ON","0034    # ==========================================================================\n0035    # @@.  PI POWER ON\n0036    # ==========================================================================\n0037    #"]
["SI HV ON","0049    # ==========================================================================\n0050    # @@.  PI HV ON\n0051    # ==========================================================================\n0052    #"]
["TLM mode change (MODE_5)","0059    # ==========================================================================\n0060    # @@. TLM MODE 5  (Mission: 7kbps, without user HK)\n0061    # ==========================================================================\n0062    #"]
["TLM mode change (MODE_10)","0028    # ==========================================================================\n0029    # @@. TLM MODE 10 (Mission: 4kbps, with user HK)\n0030    # ==========================================================================\n0031    #"]
["SI HV OFF","0207    # ==========================================================================\n0208    # @@. PI HV OFF\n0209    # ==========================================================================\n0210    #"]
["SI Power OFF","0259    # ==========================================================================\n0260    # @@. PI Power OFF\n0261    # ==========================================================================\n0262    #"]
["MSA SOFT RESET"]
["MACRO COMMAND ENA","0280    # ==========================================================================\n0281    # @@. MACRO ENA \n0282    # ==========================================================================\n0283    #"]
["CrouseCheckOut"]

{"sheet":"List","index":7,"n_rows":94,"n_cols":10,"rows_kept":94,"cut":false,"hidden":false,"merged":[[56,0,64,0],[3,0,4,0],[6,0,15,0],[16,0,17,0],[18,0,19,0],[21,0,30,0],[32,0,44,0],[47,0,55,0]]}
[null,null,"Duration (sec)","source filename","filename ",null,"cmdcount"]
["BUS ON","BUS_SETUP",687,"main2-CRCO_PART1_XOR_002_M80","main2-CRCO_PART1_XOR_002_M80",null,25]
["BUS ON","BUS_SETUP_D",577,"main2-BUS_NECP_HV_MONI_ON_XDOR_001_M60.cps","dcsm-EF_BUS_MONI_ON",null,20]
["MDP ON","MDP_SETUP",509,"main2-CRCO_PART1_XOR_002_M80","main2-CRCO_PART1_XOR_002_M80",null,11]
[null,"MDP_ON_D",509,"dcsm-EF_MDP_ON","dcsm-EF_MDP_ON",null,11]
[null,"MDP_CRUISE_SET",42,"main2-MDP_CRUISE_SET.cps","dcsm-EF_MDP_CRUISE_SET",null,2]
["SI Check","PWI_CHECK",2672,"main2-CRCO_PART1_XOR_002_M80","main2-CRCO_PART1_XOR_002_M80",null,56,null,180,{"$f":"+SUM(H7,I8,I7)","v":348}]
[null,"MGF_CHECK",4179,"main2-CRCO_PART1_XOR_002_M80","main2-CRCO_PART1_XOR_002_M80",null,52,null,{"$f":"14*12","v":168}]
[null,"MASTWPT_CHECK",2108,"main2-CRCO_PART1_XOR_002_M80","main2-CRCO_PART1_XOR_002_M80",null,46]
[null,"MDM_CHECK",1252,"main2-CRCO_PART1_XOR_002_M80","main2-CRCO_PART1_XOR_002_M80",null,19]
[null,"ENA_CHECK",1134,"main2-CRCO_PART1_XOR_002_M80","main2-CRCO_PART1_XOR_002_M80",null,17]
[null,"MEA_CHECK",4620,"main2-CRCO_PART1_XOR_002_M80","main2-CRCO_PART1_XOR_002_M80",null,51]
[null,"MSA_CHECK",1102,"main2-CRCO_PART1_XOR_002_M80","main2-CRCO_PART1_XOR_002_M80",null,18]
[null,"MIA_CHECK",1562,"main2-CRCO_PART1_XOR_002_M80","main2-CRCO_PART1_XOR_002_M80",null,16]
[null,"HEP_CHECK",4936,"main2-CRCO_PART1_XOR_002_M80","main2-CRCO_PART1_XOR_002_M80",null,{"$f":"35+47","v":82}]
[null,"MSASI_CHECK",6688,"main2-CRCO_PART1_XOR_002_M80","main2-CRCO_PART2_XOR_002_M80",null,22]
["MDP OFF","MDP_OFF",120,"main2-CRCO_PART1_XOR_002_M80","main2-CRCO_PART2_XOR_002_M80",null,3]
[null,"MDP_OFF_D",120,"dcsm-EF_MDP_POWEROFF","dcsm-EF_MDP_POWEROFF",null,3]
["BUS OFF","BUS_OFF",220,"main2-CRCO_PART1_XOR_002_M80","main2-CRCO_PART4_XOR_002_M80",null,5]
[null,"BUS_OFF_D",220,"dcsm-EF_BUS_MONI_OFF","dcsm-EF_BUS_MONI_OFF",null,5]
{"$rows_left_out":75}
{"sheet":"WOL","index":8,"n_rows":56,"n_cols":8,"rows_kept":56,"cut":false,"hidden":false,"merged":[]}
[null,null,"START　TIME","2021-08-14T09:30:00"]
[null,null,"END　TIME","2021-08-19T05:30:00"]
[null,"ID",null,"date time excel","duration(s)"]
[null,"WOLS","WOL#1","2021-08-15T05:41:33",1200]
[null,"WOLS","WOL#2","2021-08-16T05:42:56",1200]
[null,"WOLS","WOL#3","2021-08-17T05:42:10",1200]
[null,"WOLS","WOL#4","2021-08-18T05:44:25",1200]
[]
[]
[]
[]
[]
[]
[]
[]
[]
[]
[]
[null,null,"WOLS","2021-218T12:21:48.000Z",null,null,null,"2021-08-06T12:21:48"]
[null,null,"WOLE","2021-218T12:41:48.000Z"]
{"$rows_left_out":37}
{"sheet":"obs_sequence","index":9,"n_rows":61,"n_cols":14,"rows_kept":61,"cut":false,"hidden":false,"merged":[[45,5,46,5],[52,5,55,5],[3,0,3,1],[3,2,3,3],[26,5,27,5],[18,5,19,5],[42,5,43,5],[34,5,35,5],[9,5,12,5],[13,5,14,5],[21,5,22,5],[29,5,30,5],[37,5,38,5],[50,5,51,5]]}
["START",null,{"$f":"WOL!D1","v":"2021-08-14T09:30:00"},"OBCP START",{"$f":"C1-12*60*60/3600/24","v":"2021-08-13T21:30:00"},null,null,null,null,null,null,"5days"]
["END",null,{"$f":"WOL!D2","v":"2021-08-19T05:30:00"},"OBCP END",{"$f":"C2+(240+120+300)/3600/24","v":"2021-08-19T05:41:00"},"CMD END",{"$f":"C2-100/3600/24","v":"2021-08-19T05:28:20"}]
[]
["Relative time (h)",null,"Absolute time (UTC)",null,null,null,null,null,null,null,null,{"$f":"+SUM(L6:L85)","v":387}]
["Start","End","Start","End","Event","Activity","Procedure","Duration (sec)",null,null,null,"cmd count",null,"cmd count"]
[null,null,"2021-08-14T09:30:00",{"$f":"C6+H6/3600/24","v":"2021-08-14T09:39:37"},null,"BUS_ON","BUS_SETUP_D",{"$f":"VLOOKUP(G6,List!B:C,2,0)","v":577},null,null,{"$f":"VLOOKUP(G6,List!B:E,4,0)","v":"dcsm-EF_BUS_MONI_ON"},{"$f":"VLOOKUP(G6,List!B:G,6,0)","v":20},{"$f":"C6-317/3600/24","v":"2021-08-14T09:24:43"},{"$f":"+\"0000    CALL \"&K6&\" -Run\"","v":"0000    CALL dcsm-EF_BUS_MONI_ON -Run"}]
[null,null,{"$f":"+D6","v":"2021-08-14T09:39:37"},{"$f":"C7+H7/3600/24","v":"2021-08-14T09:48:06"},null,"MDP ON","MDP_ON_D",{"$f":"VLOOKUP(G7,List!B:C,2,0)","v":509},null,null,{"$f":"VLOOKUP(G7,List!B:E,4,0)","v":"dcsm-EF_MDP_ON"},{"$f":"VLOOKUP(G7,List!B:G,6,0)","v":11},{"$f":"C7-317/3600/24","v":"2021-08-14T09:34:20"},{"$f":"+\"0000    CALL \"&K7&\" -Run\"","v":"0000    CALL dcsm-EF_MDP_ON -Run"}]
[null,null,{"$f":"D7","v":"2021-08-14T09:48:06"},{"$f":"C8+H8/3600/24","v":"2021-08-14T09:48:48"},null,null,"MDP_CRUISE_SET",{"$f":"VLOOKUP(G8,List!B:C,2,0)","v":42},null,null,{"$f":"VLOOKUP(G8,List!B:E,4,0)","v":"dcsm-EF_MDP_CRUISE_SET"},{"$f":"VLOOKUP(G8,List!B:G,6,0)","v":2},"2021-08-14T09:42:49","0000    CALL dcsm-EF_MDP_CRUISE_SET -Run"]
[null,null,{"$f":"D8","v":"2021-08-14T09:48:48"},"2021-08-14T09:49:30",null,"TLM mode change (MODE_10)","TLM_MODE_10",{"$f":"VLOOKUP(G9,List!B:C,2,0)","v":42},null,null,{"$f":"VLOOKUP(G9,List!B:E,4,0)","v":"dcsm-EF_BUS_TLM_MODE_10"},{"$f":"VLOOKUP(G9,List!B:G,6,0)","v":2},"2021-08-14T09:43:31","0000    CALL dcsm-EF_BUS_TLM_MODE_10 -Run"]
[null,null,"2021-08-14T09:49:30","2021-08-14T09:54:22",null,"SI Power ON","MEA1_ON_SETUP_SW",{"$f":"VLOOKUP(G10,List!B:C,2,0)","v":292},null,null,{"$f":"VLOOKUP(G10,List!B:E,4,0)","v":"dcsm-EF_MEA1_ON_SW"},{"$f":"VLOOKUP(G10,List!B:G,6,0)","v":12},"2021-08-14T09:44:13","0000    CALL dcsm-EF_MEA1_ON_SW -Run"]
[null,null,"2021-08-14T09:54:22","2021-08-14T10:14:52",null,null,"HEP_ON_SETUP",{"$f":"VLOOKUP(G11,List!B:C,2,0)","v":1230},null,null,{"$f":"VLOOKUP(G11,List!B:E,4,0)","v":"dcsm-EF_HEP_ON_START_for_TL"},{"$f":"VLOOKUP(G11,List!B:G,6,0)","v":34},"2021-08-14T09:49:05","0000    CALL dcsm-EF_HEP_ON_START_for_TL -Run"]
[null,null,"2021-08-14T10:14:52","2021-08-14T10:16:12",null,null,"PME_ON",{"$f":"VLOOKUP(G12,List!B:C,2,0)","v":80},null,null,{"$f":"VLOOKUP(G12,List!B:E,4,0)","v":"dcsm-EF_PME_ON"},{"$f":"VLOOKUP(G12,List!B:G,6,0)","v":2},"2021-08-14T10:09:35","0000    CALL dcsm-EF_PME_ON -Run"]
[null,null,"2021-08-14T10:16:12","2021-08-14T10:16:26",null,null,"MGF_ON_SETUP",{"$f":"VLOOKUP(G13,List!B:C,2,0)","v":14},null,null,{"$f":"VLOOKUP(G13,List!B:E,4,0)","v":"dcsm-EF_MGF_ON"},{"$f":"VLOOKUP(G13,List!B:G,6,0)","v":3},"2021-08-14T10:10:55","0000    CALL dcsm-EF_MGF_ON -Run"]
[null,null,"2021-08-14T10:16:26","2021-08-14T10:44:48",null,"SI HV ON","MEA1_HV_ON",{"$f":"VLOOKUP(G14,List!B:C,2,0)","v":1702},null,null,{"$f":"VLOOKUP(G14,List!B:E,4,0)","v":"dcsm-EF_MEA1_HV_ON"},{"$f":"VLOOKUP(G14,List!B:G,6,0)","v":27},"2021-08-14T10:11:09",{"$f":"+\"0000    CALL \"&K14&\" -Run\"","v":"0000    CALL dcsm-EF_MEA1_HV_ON -Run"}]
[null,null,"2021-08-14T10:44:48","2021-08-14T10:49:18",null,null,"HEP_HV_ON",{"$f":"VLOOKUP(G15,List!B:C,2,0)","v":270},null,null,{"$f":"VLOOKUP(G15,List!B:E,4,0)","v":"dcsm-EF_HEPE_HV_ON_OBS_START"},{"$f":"VLOOKUP(G15,List!B:G,6,0)","v":6},"2021-08-14T10:39:31",{"$f":"+\"0000    CALL \"&K15&\" -Run\"","v":"0000    CALL dcsm-EF_HEPE_HV_ON_OBS_START -Run"}]
[null,null,"2021-08-14T10:49:18","2021-08-14T10:50:00",null,"TLM mode change (MODE_5)","TLM_MODE_5",{"$f":"VLOOKUP(G16,List!B:C,2,0)","v":42},"Mission: 7kbps, without user HK",null,{"$f":"VLOOKUP(G16,List!B:E,4,0)","v":"dcsm-EF_BUS_TLM_MODE_5"},{"$f":"VLOOKUP(G16,List!B:G,6,0)","v":2},"2021-08-14T10:44:01","0000    CALL dcsm-EF_BUS_TLM_MODE_5 -Run"]
[null,null,"2021-08-14T10:50:00",{"$f":"C18","v":"2021-08-15T05:34:39"},"Observation A",null,null,{"$f":"(D17-C17)*3600*24","v":67479.000001377426},{"$f":"H17/3600","v":18.744166667049285},null,"",0,"2021-08-14T10:44:43",{"$f":"\"0000    WAIT_SEC  \"&TEXT(H17,\"#0\")","v":"0000    WAIT_SEC  67479"}]
[null,null,{"$f":"D18-H18/3600/24","v":"2021-08-15T05:34:39"},{"$f":"C19","v":"2021-08-15T05:35:21"},null,"TLM mode change (MODE_10)","TLM_MODE_10",{"$f":"VLOOKUP(G18,List!B:C,2,0)","v":42},"Mission: 4kbps, with user HK",null,{"$f":"VLOOKUP(G18,List!B:E,4,0)","v":"dcsm-EF_BUS_TLM_MODE_10"},{"$f":"VLOOKUP(G18,List!B:G,6,0)","v":2},"2021-08-15T05:29:22","0000    CALL dcsm-EF_BUS_TLM_MODE_10 -Run"]
[null,null,{"$f":"D19-H19/3600/24","v":"2021-08-15T05:35:21"},{"$f":"C20","v":"2021-08-15T05:38:31"},null,"SI HV OFF","HEP_HV_OFF",{"$f":"VLOOKUP(G19,List!B:C,2,0)","v":190},null,null,{"$f":"VLOOKUP(G19,List!B:E,4,0)","v":"dcsm-EF_HEPE_HV_OFF_OBS_OFF"},{"$f":"VLOOKUP(G19,List!B:G,6,0)","v":5},"2021-08-15T05:30:04","0000    CALL dcsm-EF_HEPE_HV_OFF_OBS_OFF -Run"]
[null,null,{"$f":"D20-H20/3600/24","v":"2021-08-15T05:38:31"},{"$f":"C21","v":"2021-08-15T05:41:33"},null,null,"MEA1_HV_OFF",{"$f":"VLOOKUP(G20,List!B:C,2,0)","v":182},null,null,{"$f":"VLOOKUP(G20,List!B:E,4,0)","v":"dcsm-EF_MEA1_HV_OFF"},{"$f":"VLOOKUP(G20,List!B:G,6,0)","v":10},"2021-08-15T05:33:14","0000    CALL dcsm-EF_MEA1_HV_OFF -Run"]
{"$rows_left_out":41}