{"text_format":"1","workbook":"xlsx","n_sheets":10,"sheets":["確認事項","実行","チェック表","START","END","LOOP","COMMENT","List","WOL","obs_sequence"],"not_rendered":{"charts":0,"images":0,"macros":1,"external_links":0,"defined_names":5,"comments":0,"pivot_tables":0},"unopened":[],"bounds":{"document_bytes":16777216,"sheet_cells":100000,"rows_first":2000,"rows_last":500,"rows_between":2000,"halvings":0,"cell_chars":16384,"cell_head_chars":4096},"cells_cut":0,"cells_raw":0,"read":"whole","date_system":"1900"}

{"sheet":"確認事項","index":0,"n_rows":1,"n_cols":4,"rows_kept":1,"cut":false,"hidden":false,"merged":[]}
["NO.","確認事項","回答","CLOSE"]

{"sheet":"実行","index":1,"n_rows":16,"n_cols":6,"rows_kept":16,"cut":false,"hidden":true,"merged":[]}
[]
[]
[]
[]
[]
[]
[]
[null,null,null,null,null,"【操作】"]
["C番号",977,null,null,null,"「実行」シートの「観測作成」を押下。"]
["M番号",630701,null,null,null,"→「START」、「LOOP」、「END」を「obs_sequence」に貼り付けます。"]
[null,null,null,null,null,"「実行」シートの「時刻反映」を押下。"]
[null,null,null,null,null,"→WOLの時間と関数エラーとなっているセルを修正します。"]
[null,null,null,null,null,"【注意点】"]
[null,null,null,null,null,"「START」、「LOOP」、「END」の\"cmd count\"からシート内に何行あるかを取得しているので、ここは空白がないように\"0”を入力してください。"]
[null,null,null,null,null,"もし空白があった場合、コピー範囲が小さくなってしまいます。"]
[null,null,null,null,null,"”WOL”シートの4行目以下は、実施するWOLのみを記載すること。\n(4行目以下に、期間開始日時と終了日時の記載は不要です。)"]

{"sheet":"チェック表","index":2,"n_rows":19,"n_cols":4,"rows_kept":19,"cut":false,"hidden":true,"merged":[]}
[]
[null,"コマンド作成時注意項目"]
[null,"NO.","項目","チェック"]
[null,1,"\n観測期間開始時に「dcsm-EF_BUS_MONI_ON」手順が入っていることを確認する。\nただし、前回の観測終了時に「dcsm-EF_BUS_MONI_OFF」を実行していない場合は確認不要。\n","□"]
[null,2,"\n観測期間開始日に、観測する機器の”ON”手順が入っていることを確認する。\nただし、PWI、MGF、MAST、WPTを\"ON\"にする場合は、PWI、MGF、MAST、WPTよりも先にPMEが\"ON\"となっていること。\n※クルーズ観測中は、MEA1,HEPE,MGFのみ”ON”\n","□"]
[null,3,"\nTLM MODEが観測前に「５」　観測終了後は「１０」　となっていることを確認する\n","□"]
[null,4,"\n観測時間が”86400”を超えるていないか確認する。\n超えていた場合は、main計画作成時に途中ダミーコマンドを挿入すること\n"]
[null,5,"WOLの開始時刻が正しいことを確認する","□"]
[null,6,"\nWOLの時間を確認　HV　OFFになっていることを確認する\n↓\nクルーズ観測を行っている機器(HEPE、ENA、MIA、MEA、MSAのみ)\nフライバイを行っている機器(MSA,PWI,MGF,MEA,ENA,MIA,HEPE,MDM)\n","□"]
[null,7,"\nWOL終了時刻＋10以降にのHVがONになっていることを確認する。\nクルーズ観測を行っている機器(HEPE、ENA、MIA、MEA、MSAのみ)\nフライバイを行っている機器(MSA,PWI,MGF,MEA,ENA,MIA,HEPE,MDM)\n","□"]
[null,8,"\n観測期間最終日に、観測を行った機器の”OFF”手順が入っていることを確認する。\nただし、PWI,MGF,MAST,WPT-OFF手順の後にPME-OFF手順が入っていることを確認する。\n","□"]
[null,9,"\nMDP_POWEROFFのあとにdcsm-MC_ENA_MDPが入っていることを確認する。\n","□"]
[null,10,"\nCELのMONI ONは長時間(1h以上の場合は、山下さんと要相談)しないこと　\nBUSにはCELのみのもあるので注意　dcsm-BUS_CEL_MONI_ON　dcsm-BUS_CEL_MONI_OFF\n","□"]
[null,11,"MEA1の  SCAN ON は　dcsm-EF_MEA1_ON_SW.cpsに入っているので\n　　　順番は　MDP ONして\n　　　　　　　dcsm-EF_MEA1_ON_SW.cps\n　　　　　　　dcsm-EF_MEA1_HV_ON.cps\n　　　　　　　dcsm-EF_MEA1_HV_OFF.cps\n　　　　　　　dcsm-EF_MEA1_HV_ON.cps\n　　　　　　　dcsm-EF_MEA1_HV_SCAN_OFF.cps\n　　　　　　　dcsm-EF_MEA1_OFF.cps\n　　　　　　　MDP　OFF\n　　　　　　　\n  　　　　　　dcsm-EF_MEA_ON_SW.cps\n　　　　　　　dcsm-EF_MEA_HV_ON.cps\n　　　　　　　dcsm-EF_MEA_HV_OFF.cps\n　　　　　　　dcsm-EF_MEA_HV_ON.cps\n　　　　　　　dcsm-EF_MEA_HV_SCAN_OFF.cps\n　　　　　　　dcsm-EF_MEA_OFF.cps\n\n　　　になる\n　SCAN OFFにすると　データが出てこない　HV OFF->ON時は注意する","□"]
[null,13,"2021/6/25以降　dcsm-EF_MSA_ON_C　が最新　dcsm-EF_MSA_ONは使用しない","□"]
[null,14,"2021/6/25以降　dcsm-CRCO_MIA_CHECK_C　が最新　dcsm-CRCO_MIA_CHECKは使用しない（クルーズチェックアウトの時）","□"]
[null,15,"2021/6/25以降　dcsm-CRCO_MSA_CHECK_C　が最新　dcsm-CRCO_MSA_CHECKは使用しない（クルーズチェックアウトの時）","□"]
[null,16,"フライバイ時、MIAのHV_ON時間帯によって違うので必ず確認する\nMIA_HV_ON_RC\nMIA_HV_ON_SW_RC\nMIA_HV_ON_MAG_RC","□"]
[null,17,"Excelの時間を確認する　時間通りになっているか","□"]

{"sheet":"START","index":3,"n_rows":9,"n_cols":21,"rows_kept":9,"cut":false,"hidden":true,"merged":[[5,5,8,5]]}
["Start","End","Start","End","Event","Activity","Procedure","Duration (sec)",null,null,null,"cmd count",null,"cmd count"]
[null,null,{"$f":"#REF!","v":{"$error":"#REF!"}},{"$f":"C2+H2/3600/24","v":{"$error":"#REF!"}},null,"BUS_ON","BUS_SETUP_D",{"$f":"VLOOKUP(G2,List!B:C,2,0)","v":577},null,null,{"$f":"VLOOKUP(G2,List!B:E,4,0)","v":"dcsm-EF_BUS_MONI_ON"},{"$f":"VLOOKUP(G2,List!B:G,6,0)","v":20},null,{"$f":"+\"0000    CALL \"&K2&\" -Run\"","v":"0000    CALL dcsm-EF_BUS_MONI_ON -Run"},null,"CALL","dcsm-EF_BUS_MONI_ON",null,null,null,{"$f":"+IF(Q2=K2,\"\",\"x\")","v":""}]
[null,null,{"$f":"+D2","v":{"$error":"#REF!"}},{"$f":"C3+H3/3600/24","v":{"$error":"#REF!"}},null,"MDP ON","MDP_ON_D",{"$f":"VLOOKUP(G3,List!B:C,2,0)","v":509},null,null,{"$f":"VLOOKUP(G3,List!B:E,4,0)","v":"dcsm-EF_MDP_ON"},{"$f":"VLOOKUP(G3,List!B:G,6,0)","v":11},null,{"$f":"+\"0000    CALL \"&K3&\" -Run\"","v":"0000    CALL dcsm-EF_MDP_ON -Run"},null,"CALL","dcsm-EF_MDP_ON",null,null,null,{"$f":"+IF(Q3=K3,\"\",\"x\")","v":""}]
[null,null,{"$f":"D3","v":{"$error":"#REF!"}},{"$f":"C4+H4/3600/24","v":{"$error":"#REF!"}},null,null,"MDP_CRUISE_SET",{"$f":"VLOOKUP(G4,List!B:C,2,0)","v":42},null,null,{"$f":"VLOOKUP(G4,List!B:E,4,0)","v":"dcsm-EF_MDP_CRUISE_SET"},{"$f":"VLOOKUP(G4,List!B:G,6,0)","v":2},null,"0000    CALL dcsm-EF_MDP_CRUISE_SET -Run"]
[null,null,{"$f":"D4","v":{"$error":"#REF!"}},{"$error":"#REF!"},null,"TLM mode change (MODE_10)","TLM_MODE_10",{"$f":"VLOOKUP(G5,List!B:C,2,0)","v":42},null,null,{"$f":"VLOOKUP(G5,List!B:E,4,0)","v":"dcsm-EF_BUS_TLM_MODE_10"},{"$f":"VLOOKUP(G5,List!B:G,6,0)","v":2},null,"0000    CALL dcsm-EF_BUS_TLM_MODE_10 -Run"]
[null,null,{"$error":"#REF!"},{"$error":"#REF!"},null,"SI Power ON","MEA1_ON_SETUP_SW",{"$f":"VLOOKUP(G6,List!B:C,2,0)","v":292},null,null,{"$f":"VLOOKUP(G6,List!B:E,4,0)","v":"dcsm-EF_MEA1_ON_SW"},{"$f":"VLOOKUP(G6,List!B:G,6,0)","v":12},null,"0000    CALL dcsm-EF_MEA1_ON_SW -Run"]
[null,null,{"$error":"#REF!"},{"$error":"#REF!"},null,null,"HEP_ON_SETUP",{"$f":"VLOOKUP(G7,List!B:C,2,0)","v":1230},null,null,{"$f":"VLOOKUP(G7,List!B:E,4,0)","v":"dcsm-EF_HEP_ON_START_for_TL"},{"$f":"VLOOKUP(G7,List!B:G,6,0)","v":34},null,"0000    CALL dcsm-EF_HEP_ON_START_for_TL -Run",null,"CALL","dcsm-EF_MDP_CRUISE_SET",null,null,null,"x"]
[null,null,{"$error":"#REF!"},{"$error":"#REF!"},null,null,"PME_ON",{"$f":"VLOOKUP(G8,List!B:C,2,0)","v":80},null,null,{"$f":"VLOOKUP(G8,List!B:E,4,0)","v":"dcsm-EF_PME_ON"},{"$f":"VLOOKUP(G8,List!B:G,6,0)","v":2},null,"0000    CALL dcsm-EF_PME_ON -Run",null,"CALL","dcsm-EF_BUS_TLM_MODE_10",null,null,null,"x"]
[null,null,{"$error":"#REF!"},{"$error":"#REF!"},null,null,"MGF_ON_SETUP",{"$f":"VLOOKUP(G9,List!B:C,2,0)","v":14},null,null,{"$f":"VLOOKUP(G9,List!B:E,4,0)","v":"dcsm-EF_MGF_ON"},{"$f":"VLOOKUP(G9,List!B:G,6,0)","v":3},null,"0000    CALL dcsm-EF_MGF_ON -Run"]

{"sheet":"END","index":4,"n_rows":9,"n_cols":21,"rows_kept":9,"cut":false,"hidden":true,"merged":[[1,5,4,5]]}
["Start","End","Start","End","Event","Activity","Procedure","Duration (sec)",null,null,null,"cmd count",null,"cmd count"]
[null,null,{"$f":"D2-H2/3600/24","v":{"$error":"#REF!"}},{"$f":"C3","v":{"$error":"#REF!"}},null,"SI OFF","HEP_OFF",{"$f":"VLOOKUP(G2,List!B:C,2,0)","v":70},null,null,{"$f":"VLOOKUP(G2,List!B:E,4,0)","v":"dcsm-EF_HEPE_OFF_STOP"},{"$f":"VLOOKUP(G2,List!B:G,6,0)","v":4},null,{"$f":"+\"0000    CALL \"&K2&\" -Run\"","v":"0000    CALL dcsm-EF_HEPE_OFF_STOP -Run"},null,"CALL","dcsm-EF_HEPE_OFF_STOP",null,null,null,{"$f":"+IF(Q2=K2,\"\",\"x\")","v":""}]
[null,null,{"$error":"#REF!"},{"$error":"#REF!"},null,null,"MEA1_OFF",{"$f":"VLOOKUP(G3,List!B:C,2,0)","v":160},null,null,{"$f":"VLOOKUP(G3,List!B:E,4,0)","v":"dcsm-EF_MEA1_OFF"},{"$f":"VLOOKUP(G3,List!B:G,6,0)","v":4},null,{"$f":"+\"0000    CALL \"&K3&\" -Run\"","v":"0000    CALL dcsm-EF_MEA1_OFF -Run"},null,"CALL","dcsm-EF_MEA1_OFF",null,null,null,""]
[null,null,{"$error":"#REF!"},{"$error":"#REF!"},null,null,"MGF_OFF",{"$f":"VLOOKUP(G4,List!B:C,2,0)","v":8},null,null,{"$f":"VLOOKUP(G4,List!B:E,4,0)","v":"dcsm-EF_MGF_OFF"},{"$f":"VLOOKUP(G4,List!B:G,6,0)","v":1},null,"0000    CALL dcsm-EF_MGF_OFF -Run",null,"CALL","dcsm-EF_MGF_OFF",null,null,null,""]
[null,null,{"$error":"#REF!"},{"$error":"#REF!"},null,null,"PME_OFF",{"$f":"VLOOKUP(G5,List!B:C,2,0)","v":40},null,null,{"$f":"VLOOKUP(G5,List!B:E,4,0)","v":"dcsm-EF_PME_OFF"},{"$f":"VLOOKUP(G5,List!B:G,6,0)","v":1},null,"0000    CALL dcsm-EF_PME_OFF -Run",null,"CALL","dcsm-EF_PME_OFF",null,null,null,""]
[null,null,{"$error":"#REF!"},{"$error":"#REF!"},null,"MDP OFF","MDP_OFF_D",{"$f":"VLOOKUP(G6,List!B:C,2,0)","v":120},null,null,{"$f":"VLOOKUP(G6,List!B:E,4,0)","v":"dcsm-EF_MDP_POWEROFF"},{"$f":"VLOOKUP(G6,List!B:G,6,0)","v":3},null,"0000    CALL dcsm-EF_MDP_POWEROFF -Run",null,"CALL","dcsm-EF_MDP_POWEROFF",null,null,null,""]
[null,null,{"$error":"#REF!"},{"$error":"#REF!"},null,"MACRO ENA","MC_ENA",{"$f":"VLOOKUP(G7,List!B:C,2,0)","v":246},null,null,{"$f":"VLOOKUP(G7,List!B:E,4,0)","v":"dcsm-MC_ENA_MDP"},{"$f":"VLOOKUP(G7,List!B:G,6,0)","v":21},null,"0000    CALL dcsm-MC_ENA_MDP -Run",null,"CALL","dcsm-MC_ENA_MDP",null,null,null,""]
[null,null,{"$error":"#REF!"},{"$f":"C9","v":{"$error":"#REF!"}},null,"BUS OFF","BUS_OFF_D",{"$f":"VLOOKUP(G8,List!B:C,2,0)","v":220},null,null,{"$f":"VLOOKUP(G8,List!B:E,4,0)","v":"dcsm-EF_BUS_MONI_OFF"},{"$f":"VLOOKUP(G8,List!B:G,6,0)","v":5},null,"0000    CALL dcsm-EF_BUS_MONI_OFF -Run",null,null,null,null,null,null,{"$f":"+IF(Q7=K8,\"\",\"x\")","v":"x"}]
[null,null,{"$f":"#REF!","v":{"$error":"#REF!"}},{"$f":"C9+H9/3600/24","v":{"$error":"#REF!"}},{"$f":"#REF!","v":{"$error":"#REF!"}},null,"END",1200,null,null,{"$f":"VLOOKUP(G9,List!B:E,4,0)","v":{"$error":"#N/A"}},0]

{"sheet":"LOOP","index":5,"n_rows":9,"n_cols":21,"rows_kept":9,"cut":false,"hidden":true,"merged":[[1,5,2,5],[6,5,7,5]]}
["Start","End","Start","End","Event","Activity","Procedure","Duration (sec)",null,null,null,"cmd count",null,"cmd count"]
[null,null,{"$f":"D1","v":"End"},{"$f":"C2+H2/3600/24","v":{"$error":"#VALUE!"}},null,"SI HV ON","MEA1_HV_ON",{"$f":"VLOOKUP(G2,List!B:C,2,0)","v":1702},null,null,{"$f":"VLOOKUP(G2,List!B:E,4,0)","v":"dcsm-EF_MEA1_HV_ON"},{"$f":"VLOOKUP(G2,List!B:G,6,0)","v":27},null,{"$f":"+\"0000    CALL \"&K2&\" -Run\"","v":"0000    CALL dcsm-EF_MEA1_HV_ON -Run"},null,"CALL","dcsm-EF_MEA1_HV_ON",null,null,null,{"$f":"+IF(Q2=K2,\"\",\"x\")","v":""}]
[null,null,{"$error":"#VALUE!"},{"$error":"#VALUE!"},null,null,"HEP_HV_ON",{"$f":"VLOOKUP(G3,List!B:C,2,0)","v":270},null,null,{"$f":"VLOOKUP(G3,List!B:E,4,0)","v":"dcsm-EF_HEPE_HV_ON_OBS_START"},{"$f":"VLOOKUP(G3,List!B:G,6,0)","v":6},null,{"$f":"+\"0000    CALL \"&K3&\" -Run\"","v":"0000    CALL dcsm-EF_HEPE_HV_ON_OBS_START -Run"},null,"CALL","dcsm-EF_HEPE_HV_ON_OBS_START",null,null,null,""]
[null,null,{"$error":"#VALUE!"},{"$error":"#VALUE!"},null,"TLM mode change (MODE_5)","TLM_MODE_5",{"$f":"VLOOKUP(G4,List!B:C,2,0)","v":42},"Mission: 7kbps, without user HK",null,{"$f":"VLOOKUP(G4,List!B:E,4,0)","v":"dcsm-EF_BUS_TLM_MODE_5"},{"$f":"VLOOKUP(G4,List!B:G,6,0)","v":2},null,"0000    CALL dcsm-EF_BUS_TLM_MODE_5 -Run",null,"CALL","dcsm-EF_BUS_TLM_MODE_5",null,null,null,""]
[null,null,{"$error":"#VALUE!"},{"$f":"C6","v":{"$error":"#REF!"}},"Observation A",null,null,{"$f":"(D5-C5)*3600*24","v":{"$error":"#REF!"}},{"$f":"H5/3600","v":{"$error":"#REF!"}},null,"",0,null,{"$f":"\"0000    WAIT_SEC  \"&TEXT(H5,\"#0\")","v":{"$error":"#REF!"}},null,"WAIT_SEC",26900,null,null,null,"x"]
[null,null,{"$f":"D6-H6/3600/24","v":{"$error":"#REF!"}},{"$f":"C7","v":{"$error":"#REF!"}},null,"TLM mode change (MODE_10)","TLM_MODE_10",{"$f":"VLOOKUP(G6,List!B:C,2,0)","v":42},"Mission: 4kbps, with user HK",null,{"$f":"VLOOKUP(G6,List!B:E,4,0)","v":"dcsm-EF_BUS_TLM_MODE_10"},{"$f":"VLOOKUP(G6,List!B:G,6,0)","v":2},null,"0000    CALL dcsm-EF_BUS_TLM_MODE_10 -Run",null,"CALL","dcsm-EF_BUS_TLM_MODE_10",null,null,null,""]
[null,null,{"$f":"D7-H7/3600/24","v":{"$error":"#REF!"}},{"$f":"C8","v":{"$error":"#REF!"}},null,"SI HV OFF","HEP_HV_OFF",{"$f":"VLOOKUP(G7,List!B:C,2,0)","v":190},null,null,{"$f":"VLOOKUP(G7,List!B:E,4,0)","v":"dcsm-EF_HEPE_HV_OFF_OBS_OFF"},{"$f":"VLOOKUP(G7,List!B:G,6,0)","v":5},null,"0000    CALL dcsm-EF_HEPE_HV_OFF_OBS_OFF -Run",null,"CALL","dcsm-EF_HEPE_HV_OFF_OBS_OFF",null,null,null,""]
[null,null,{"$f":"D8-H8/3600/24","v":{"$error":"#REF!"}},{"$f":"C9","v":{"$error":"#REF!"}},null,null,"MEA1_HV_OFF",{"$f":"VLOOKUP(G8,List!B:C,2,0)","v":182},null,null,{"$f":"VLOOKUP(G8,List!B:E,4,0)","v":"dcsm-EF_MEA1_HV_OFF"},{"$f":"VLOOKUP(G8,List!B:G,6,0)","v":10},null,"0000    CALL dcsm-EF_MEA1_HV_OFF -Run",null,"CALL","dcsm-EF_MEA1_HV_OFF",null,null,null,""]
[null,null,{"$f":"#REF!","v":{"$error":"#REF!"}},{"$f":"C9+H9/3600/24","v":{"$error":"#REF!"}},"WOL",null,{"$f":"(#REF!-D8)*24*3600","v":{"$error":"#REF!"}},1200,null,null,{"$f":"VLOOKUP(G9,List!B:E,4,0)","v":{"$error":"#REF!"}},0,null,{"$f":"\"0000    WAIT_SEC  \"&TEXT(G9,\"#0\")","v":{"$error":"#REF!"}},null,"WAIT_SEC",1800,null,null,null,{"$error":"#REF!"}]

{"sheet":"COMMENT","index":6,"n_rows":19,"n_cols":2,"rows_kept":19,"cut":false,"hidden":true,"merged":[]}
["activity","Comment"]
["main_start","#!HEAD: main2-CROUSE_OBS6_XDOR_001_M63 2021-07-01 01:18:36 478        45 MMO                  MAIN2               // Earth Fly-by                \n0001  . # LET                  @ONERR=NEXT                   \n0002  . # ==========================================================================\n0003    #  <startTime>2021-07-06T08:00:00Z</startTime>\n0004    #  <stopTime>2021-07-15T10:00:00Z</stopTime>\n0005    #  << XDOR:XDOR_BJXR_C%%%_CRCO_M&&&&&&_00001.BC >> 連続送信*****\n0006    #  << XOR:XOR__BJXR_C%%%_CRCO_M&&&&&&_00001.BC >> *****\n0007    # ==========================================================================\n0008    # ==========================================================================\n0009  . #  EXEC_AT 2021-07-06 08:00:00\n0010    # ◆◇◆◇◆◇◆◇◆◇◆◇◆◇◆◇◆◇◆◇◆◇◆◇◆◇◆◇◆◇◆◇◆◇◆◇◆"]
["main_end","0291    #############################################################################\n0292    # =========================================================================="]
["OBS","0068    # ==========================================================================\n0069    # @@. Observation \\\\\n0070    # ==========================================================================\n0071    #"]
["WOL","0217    # ==========================================================================\n0218    # @@. WOL # $$\n0219    # ==========================================================================\n0220    #"]
["BUS_ON","0016    # ==========================================================================\n0017    # @@. BUS ON \n0018    # ==========================================================================\n0019    #"]
["MDP ON","0020    # ==========================================================================\n0021    # @@. MDP ON\n0022    # ==========================================================================\n0023    #"]
["SI Check"]
["MDP OFF","0274    # ==========================================================================\n0275    # @@. MDP OFF\n0276    # ==========================================================================\n0277    #"]
["BUS OFF","0285    # ==========================================================================\n0286    # @@. BUS MONI OFF\n0287    # ==========================================================================\n0288    #"]
["SI Power ON","0034    # ==========================================================================\n0035    # @@.  PI POWER ON\n0036    # ==========================================================================\n0037    #"]
["SI HV ON","0049    # ==========================================================================\n0050    # @@.  PI HV ON\n0051    # ==========================================================================\n0052    #"]
["TLM mode change (MODE_5)","0059    # ==========================================================================\n0060    # @@. TLM MODE 5  (Mission: 7kbps, without user HK)\n0061    # ==========================================================================\n0062    #"]
["TLM mode change (MODE_10)","0028    # ==========================================================================\n0029    # @@. TLM MODE 10 (Mission: 4kbps, with user HK)\n0030    # ==========================================================================\n0031    #"]
["SI HV OFF","0207    # ==========================================================================\n0208    # @@. PI HV OFF\n0209    # ==========================================================================\n0210    #"]
["SI Power OFF","0259    # ==========================================================================\n0260    # @@. PI Power OFF\n0261    # ==========================================================================\n0262    #"]
["MSA SOFT RESET"]
["MACRO COMMAND ENA","0280    # ==========================================================================\n0281    # @@. MACRO ENA \n0282    # ==========================================================================\n0283    #"]
["CrouseCheckOut"]

{"sheet":"List","index":7,"n_rows":94,"n_cols":10,"rows_kept":94,"cut":false,"hidden":false,"merged":[[56,0,64,0],[3,0,4,0],[6,0,15,0],[16,0,17,0],[18,0,19,0],[21,0,30,0],[32,0,44,0],[47,0,55,0]]}
[null,null,"Duration (sec)","source filename","filename ",null,"cmdcount"]
["BUS ON","BUS_SETUP",687,"main2-CRCO_PART1_XOR_002_M80","main2-CRCO_PART1_XOR_002_M80",null,25]
["BUS ON","BUS_SETUP_D",577,"main2-BUS_NECP_HV_MONI_ON_XDOR_001_M60.cps","dcsm-EF_BUS_MONI_ON",null,20]
["MDP ON","MDP_SETUP",509,"main2-CRCO_PART1_XOR_002_M80","main2-CRCO_PART1_XOR_002_M80",null,11]
[null,"MDP_ON_D",509,"dcsm-EF_MDP_ON","dcsm-EF_MDP_ON",null,11]
[null,"MDP_CRUISE_SET",42,"main2-MDP_CRUISE_SET.cps","dcsm-EF_MDP_CRUISE_SET",null,2]
["SI Check","PWI_CHECK",2672,"main2-CRCO_PART1_XOR_002_M80","main2-CRCO_PART1_XOR_002_M80",null,56,null,180,{"$f":"+SUM(H7,I8,I7)","v":348}]
[null,"MGF_CHECK",4179,"main2-CRCO_PART1_XOR_002_M80","main2-CRCO_PART1_XOR_002_M80",null,52,null,{"$f":"14*12","v":168}]
[null,"MASTWPT_CHECK",2108,"main2-CRCO_PART1_XOR_002_M80","main2-CRCO_PART1_XOR_002_M80",null,46]
[null,"MDM_CHECK",1252,"main2-CRCO_PART1_XOR_002_M80","main2-CRCO_PART1_XOR_002_M80",null,19]
[null,"ENA_CHECK",1134,"main2-CRCO_PART1_XOR_002_M80","main2-CRCO_PART1_XOR_002_M80",null,17]
[null,"MEA_CHECK",4620,"main2-CRCO_PART1_XOR_002_M80","main2-CRCO_PART1_XOR_002_M80",null,51]
[null,"MSA_CHECK",1102,"main2-CRCO_PART1_XOR_002_M80","main2-CRCO_PART1_XOR_002_M80",null,18]
[null,"MIA_CHECK",1562,"main2-CRCO_PART1_XOR_002_M80","main2-CRCO_PART1_XOR_002_M80",null,16]
[null,"HEP_CHECK",4936,"main2-CRCO_PART1_XOR_002_M80","main2-CRCO_PART1_XOR_002_M80",null,{"$f":"35+47","v":82}]
[null,"MSASI_CHECK",6688,"main2-CRCO_PART1_XOR_002_M80","main2-CRCO_PART2_XOR_002_M80",null,22]
["MDP OFF","MDP_OFF",120,"main2-CRCO_PART1_XOR_002_M80","main2-CRCO_PART2_XOR_002_M80",null,3]
[null,"MDP_OFF_D",120,"dcsm-EF_MDP_POWEROFF","dcsm-EF_MDP_POWEROFF",null,3]
["BUS OFF","BUS_OFF",220,"main2-CRCO_PART1_XOR_002_M80","main2-CRCO_PART4_XOR_002_M80",null,5]
[null,"BUS_OFF_D",220,"dcsm-EF_BUS_MONI_OFF","dcsm-EF_BUS_MONI_OFF",null,5]
[null,"TCSF_MSASI",345,"dcsm-tcfs_tbl1_msasi_set.cps","dcsm-tcfs_tbl1_msasi_set",null,13]
["SI Power ON","MSA_ON_SETUP",1092,"main2-MSA_ON.cps","dcsm-EF_MSA_ON",null,15]
[null,"PME_ON",80,"main2-PME_ON.cps","dcsm-EF_PME_ON",null,2]
[null,"PWI_ON_SETUP",868,"dcsm-EF_PWI_ON_CRUSE.cps","dcsm-EF_PWI_ON_CRUISE",null,27,520]
[null,"MGF_ON_SETUP",14,"20200410_Earth-fly-by_MGF_ON_20200221.cps","dcsm-EF_MGF_ON",null,3]
[null,"MEA_ON_SETUP_SW",386,"MEA_Earth_Flyby_1_ON_HVOFF.cps, ","dcsm-EF_MEA_ON_SW",null,21]
[null,"MEA1_ON_SETUP_SW",292,"MEA_Earth_Flyby_1_ON_HVOFF.cps, ","dcsm-EF_MEA1_ON_SW",null,12]
[null,"MEA_ON_SETUP_MAG",386,"MEA_Earth_Flyby_4_ON_HVOFF.cps","dcsm-EF_MEA_ON_MAG",null,21]
[null,"ENA_ON_SETUP",564,"ENA_power_ON.cps","dcsm-EF_ENA_power_ON",null,7]
[null,"MIA_ON_SETUP",382,"main2-MIA_ON.cps","dcsm-EF_MIA_ON",null,6]
[null,"HEP_ON_SETUP",1230,"main2-HEP_ON_START_for_TL.cps","dcsm-EF_HEP_ON_START_for_TL",null,34]
[null,"MDM_ON_SETUP",202,"クルーズ観測手順.txt","dcsm-EF_MDM_ON","暫定的に600sec入れてある",6]
["SI HV ON","MEA_HV_ON",1756,"MEA_Earth_Flyby_2_ON_HVON.cps, MEA_Earth_Flyby_5_ON_HVON.cps, MEA_Earth_Flyby_7_ON_HVON.cps","dcsm-EF_MEA_HV_ON",null,54]
[null,"MEA1_HV_ON",1702,"MEA_Earth_Flyby_2_ON_HVON.cps, MEA_Earth_Flyby_5_ON_HVON.cps, MEA_Earth_Flyby_7_ON_HVON.cps","dcsm-EF_MEA1_HV_ON",null,27]
[null,"MIA_HV_ON",240,"main2-MIA_HV_ON.cps","dcsm-EF_MIA_HV_ON",null,6]
[null,"MIA_HV_ON_MAG",142,"main2-MIA_HV_ON_MAG.cps","dcsm-EF_MIA_HV_ON_MAG",null,4]
[null,"MIA_HV_ON_SW",102,"main2-MIA_HV_ON_SW.cps","dcsm-EF_MIA_HV_ON_SW",null,3]
[null,"MIA_HV_ON_RC",280,"main2-MIA_HV_ON.cps","dcsm-EF_MIA_HV_ON_RC",null,7]
[null,"MIA_HV_ON_MAG_RC",262,"main2-MIA_HV_ON_MAG.cps","dcsm-EF_MIA_HV_ON_MAG_RC",null,7]
[null,"MIA_HV_ON_SW_RC",262,"main2-MIA_HV_ON_SW.cps","dcsm-EF_MIA_HV_ON_SW_RC",null,7]
[null,"MSA_HV_ON",10954,"main2-MSA_HV_ON.cps","dcsm-EF_MSA_HV_ON_1,dcsm-EF_MSA_HV_ON_2",null,232]
[null,"MSA_HV_ON_VFB",6144,"main2-MSA_HV_ON.cps","dcsm-EF_MSA_HV_ON_1_VFB,dcsm-EF_MSA_HV_ON_2_VFB",null,232]
[null,"ENA_HV_ON",344,"ENA_HV_ON.cps","dcsm-EF_ENA_HV_ON",null,18]
[null,"ENA_HV_ON_H",344,"ENA_HV_ON_H.cps","dcsm-EF_ENA_HV_ON_H",null,18]
[null,"HEP_HV_ON",270,"main2-HEPE_HV_ON_OBS_START.cps","dcsm-EF_HEPE_HV_ON_OBS_START",null,6]
["TLM mode change (MODE_5)","TLM_MODE_5",42,"main2-BUS_TLM_MODE_5.cps","dcsm-EF_BUS_TLM_MODE_5",null,2]
["TLM mode change (MODE_10)","TLM_MODE_10",42,"main2-BUS_TLM_MODE_10.cps","dcsm-EF_BUS_TLM_MODE_10",null,2]
["SI HV OFF","HEP_HV_OFF",190,"main2-HEPE_HV_OFF_OBS_OFF.cps","dcsm-EF_HEPE_HV_OFF_OBS_OFF",null,5]
[null,"ENA_HV_OFF",198,"ENA_HV_OFF.cps","dcsm-EF_ENA_HV_OFF",null,4]
[null,"MSA_HV_OFF",714,"main2-MSA_HV_OFF.cps","dcsm-EF_MSA_HV_OFF",null,24]
[null,"MSA_HV_OFF_VFB",774,"main2-MSA_HV_OFF.cps","dcsm-EF_MSA_HV_OFF_VFB",null,25]
[null,"MIA_HV_OFF",60,"main2-MIA_HV_OFF.cps","dcsm-EF_MIA_HV_OFF",null,1]
[null,"MEA_HV_SCAN_OFF",210,"MEA_Earth_Flyby_3_OFF.cps,MEA_Earth_Flyby_8_OFF.cps(shutdownなし）","dcsm-EF_MEA_HV_SCAN_OFF",null,24]
[null,"MEA1_HV_SCAN_OFF",186,"MEA_Earth_Flyby_3_OFF.cps,MEA_Earth_Flyby_8_OFF.cps(shutdownなし）","dcsm-EF_MEA1_HV_SCAN_OFF",null,12]
[null,"MEA_HV_OFF",202,"MEA_Earth_Flyby_6_ON_HVOFF.cps","dcsm-EF_MEA_HV_OFF",null,20]
[null,"MEA1_HV_OFF",182,"dcsm-EF_MEA1_HV_OFF.cps","dcsm-EF_MEA1_HV_OFF",null,10]
["SI Power OFF","HEP_OFF",70,"main2-HEPE_OFF_STOP.cps","dcsm-EF_HEPE_OFF_STOP",null,4]
[null,"MIA_OFF",160,"main2-MIA_OFF.cps","dcsm-EF_MIA_OFF",null,4]
[null,"ENA_OFF",88,"ENA_power_OFF.cps","dcsm-EF_ENA_power_OFF",null,4]
[null,"MEA_OFF",164,"MEA_Earth_Flyby_3_OFF.cps,MEA_Earth_Flyby_8_OFF.cps(shutdown)のみ","dcsm-EF_MEA_OFF",null,6]
[null,"MEA1_OFF",160,"MEA_Earth_Flyby_3_OFF.cps,MEA_Earth_Flyby_8_OFF.cps(shutdown)のみ","dcsm-EF_MEA1_OFF",null,4]
[null,"MGF_OFF",8,"20200410_Earth-fly-by_MGF_OFF_20200221.cps","dcsm-EF_MGF_OFF",null,1]
[null,"PWI_OFF",80,"main2-PWI_OFF.cps","dcsm-EF_PWI_OFF",null,2]
[null,"PME_OFF",40,"main2-PME_OFF.cps","dcsm-EF_PME_OFF",null,1]
[null,"MSA_OFF",380,"main2-MSA_OFF.cps","dcsm-EF_MSA_OFF",null,25]
[null,"MDM_OFF",160,"クルーズ観測手順.txt","dcsm-EF_MDM_OFF","暫定的に600sec入れてある",4]
["MSA SOFT RESET","MSA_SOFT_RESET2",100,"dcsm-EF_MSA_SOFT_RESET2.cps","dcsm-EF_MSA_SOFT_RESET2",null,5]
["MACRO COMMAND ENA","MC_ENA",246,"main2-MC_ENA_MDP_XDOR_001_M58.cps","dcsm-MC_ENA_MDP",null,21]
[null,"WAIT3600",3600]
[null,"WAIT3500",3500]
[null,"MSASI_DARK_1",768,"dcsm-MSASI_dark_CO_sequence1.cps","dcsm-MSASI_dark_CO_sequence1",null,11,{"$f":"5*60*60+21*60+47","v":19307}]
[null,"MSASI_DARK_2",19498,"dcsm-MSASI_dark_CO_sequence2.cps","dcsm-MSASI_dark_CO_sequence2",null,55,{"$f":"5*60*60+21*60+47","v":19307}]
[null,"MEA2_MEM_DMP",2550,"dcsm-MEA2_MEM_DMP.cps","dcsm-MEA2_MEM_DMP",null,36]
[null,"WAIT19357",19357]
[null,"WAIT1800",1800,null,"WAIT_SEC 1800"]
[null,"MDP_ERR_LOG_DUMP",9080,"main2-MDP_ERR_LOG_DUMP_TL_XDOR_001_M08","dcsm-MDP_ERR_LOG_DUMP",null,6]
["CrouseCheckOut","CRCO_BUS_MONI_ON",310,"main2-CRCO_PART1_XOR_003_M80","dcsm-CRCO_BUS_MONI_ON"]
[null,"CRCO_ENA",1134,"main2-CRCO_PART1_XOR_003_M80","dcsm-CRCO_ENA_CHECK"]
[null,"CRCO_HEPE",2206,"main2-CRCO_PART1_XOR_003_M80","dcsm-CRCO_HEPE_CHECK"]
[null,"CRCO_HEPI",2730,"main2-CRCO_PART1_XOR_003_M80","dcsm-CRCO_HEPI_CHECK"]
[null,"CRCO_MASTWPT",1848,"main2-CRCO_PART1_XOR_003_M80","dcsm-CRCO_MASTWPT_CHECK"]
[null,"CRCO_MDM",2332,"main2-CRCO_PART1_XOR_003_M80","dcsm-CRCO_MDM_CHECK"]
[null,"CRCO_MDP_OFF",120,"main2-CRCO_PART1_XOR_003_M80","dcsm-CRCO_MDP_OFF"]
[null,"CRCO_MDP_ON",509,"main2-CRCO_PART1_XOR_003_M80","dcsm-CRCO_MDP_ON"]
[null,"CRCO_MEA",4620,"main2-CRCO_PART1_XOR_003_M80","dcsm-CRCO_MEA_CHECK"]
[null,"CRCO_MGF",4019,"main2-CRCO_PART1_XOR_003_M80","dcsm-CRCO_MGF_CHECK"]
[null,"CRCO_MIA",1562,"main2-CRCO_PART1_XOR_003_M80","dcsm-CRCO_MIA_CHECK"]
[null,"CRCO_MSASI",6688,"main2-CRCO_PART1_XOR_003_M80","dcsm-CRCO_MSASI_CHECK"]
[null,"CRCO_MSA",1102,"main2-CRCO_PART1_XOR_003_M80","dcsm-CRCO_MSA_CHECK"]
[null,"CRCO_PME_OFF",160,"main2-CRCO_PART1_XOR_003_M80","dcsm-CRCO_PME_OFF"]
[null,"CRCO_PME_ON",160,"main2-CRCO_PART1_XOR_003_M80","dcsm-CRCO_PME_ON"]
[null,"CRCO_PWI",2512,"main2-CRCO_PART1_XOR_003_M80","dcsm-CRCO_PWI_CHECK"]
[null,"CRCO_SI_READY",377,"main2-CRCO_PART1_XOR_003_M80","dcsm-CRCO_SI_READY"]
[null,"MSA_ON_SETUP_C",1092,"main2-MSA_ON.cps","dcsm-EF_MSA_ON_C",null,15]

{"sheet":"WOL","index":8,"n_rows":56,"n_cols":8,"rows_kept":56,"cut":false,"hidden":false,"merged":[]}
[null,null,"START　TIME","2021-08-14T09:30:00"]
[null,null,"END　TIME","2021-08-19T05:30:00"]
[null,"ID",null,"date time excel","duration(s)"]
[null,"WOLS","WOL#1","2021-08-15T05:41:33",1200]
[null,"WOLS","WOL#2","2021-08-16T05:42:56",1200]
[null,"WOLS","WOL#3","2021-08-17T05:42:10",1200]
[null,"WOLS","WOL#4","2021-08-18T05:44:25",1200]
[]
[]
[]
[]
[]
[]
[]
[]
[]
[]
[]
[null,null,"WOLS","2021-218T12:21:48.000Z",null,null,null,"2021-08-06T12:21:48"]
[null,null,"WOLE","2021-218T12:41:48.000Z"]
[null,null,"WOLS","2021-219T07:45:31.000Z"]
[null,null,"WOLE","2021-219T08:05:31.000Z"]
[null,null,"WOLS","2021-220T07:56:05.000Z"]
[null,null,"WOLE","2021-220T08:16:05.000Z"]
[null,null,"WOLS","2021-221T00:21:54.000Z"]
[null,null,"WOLE","2021-221T00:41:54.000Z"]
[null,null,"WOLS","2021-221T15:21:54.000Z"]
[null,null,"WOLE","2021-221T15:41:54.000Z"]
[null,null,"WOLS","2021-222T05:51:54.000Z"]
[null,null,"WOLE","2021-222T06:11:54.000Z"]
[null,null,"WOLS","2021-222T09:31:54.000Z"]
[null,null,"WOLE","2021-222T09:51:54.000Z"]
[null,null,"WOLS","2021-222T14:54:24.000Z"]
[null,null,"WOLE","2021-222T15:14:24.000Z"]
[null,null,"WOLS","2021-222T22:51:54.000Z"]
[null,null,"WOLE","2021-222T23:11:54.000Z"]
[null,null,"WOLS","2021-223T10:51:54.000Z"]
[null,null,"WOLE","2021-223T11:11:54.000Z"]
[null,null,"WOLS","2021-223T23:21:54.000Z"]
[null,null,"WOLE","2021-223T23:41:54.000Z"]
[null,null,"WOLS","2021-224T21:04:27.000Z"]
[null,null,"WOLE","2021-224T21:24:27.000Z"]
[null,null,"WOLS","2021-225T05:39:16.000Z"]
[null,null,"WOLE","2021-225T05:59:16.000Z"]
[null,null,"WOLS","2021-226T09:16:03.000Z",null,null,null,"2021-08-14T09:16:03"]
[null,null,"WOLE","2021-226T09:36:03.000Z"]
[null,null,"WOLS","2021-227T05:41:33.000Z",null,null,null,"2021-08-15T05:41:33"]
[null,null,"WOLE","2021-227T06:01:33.000Z"]
[null,null,"WOLS","2021-228T05:42:56.000Z",null,null,null,"2021-08-16T05:42:56"]
[null,null,"WOLE","2021-228T06:02:56.000Z"]
[null,null,"WOLS","2021-229T05:42:10.000Z",null,null,null,"2021-08-17T05:42:10"]
[null,null,"WOLE","2021-229T06:02:10.000Z"]
[null,null,"WOLS","2021-230T05:44:25.000Z",null,null,null,"2021-08-18T05:44:25"]
[null,null,"WOLE","2021-230T06:04:25.000Z"]
[null,null,"WOLS","2021-231T05:46:04.000Z",null,null,null,"2021-08-19T05:46:04"]
[null,null,"WOLE","2021-231T06:06:04.000Z"]

{"sheet":"obs_sequence","index":9,"n_rows":61,"n_cols":14,"rows_kept":61,"cut":false,"hidden":false,"merged":[[45,5,46,5],[52,5,55,5],[3,0,3,1],[3,2,3,3],[26,5,27,5],[18,5,19,5],[42,5,43,5],[34,5,35,5],[9,5,12,5],[13,5,14,5],[21,5,22,5],[29,5,30,5],[37,5,38,5],[50,5,51,5]]}
["START",null,{"$f":"WOL!D1","v":"2021-08-14T09:30:00"},"OBCP START",{"$f":"C1-12*60*60/3600/24","v":"2021-08-13T21:30:00"},null,null,null,null,null,null,"5days"]
["END",null,{"$f":"WOL!D2","v":"2021-08-19T05:30:00"},"OBCP END",{"$f":"C2+(240+120+300)/3600/24","v":"2021-08-19T05:41:00"},"CMD END",{"$f":"C2-100/3600/24","v":"2021-08-19T05:28:20"}]
[]
["Relative time (h)",null,"Absolute time (UTC)",null,null,null,null,null,null,null,null,{"$f":"+SUM(L6:L85)","v":387}]
["Start","End","Start","End","Event","Activity","Procedure","Duration (sec)",null,null,null,"cmd count",null,"cmd count"]
[null,null,"2021-08-14T09:30:00",{"$f":"C6+H6/3600/24","v":"2021-08-14T09:39:37"},null,"BUS_ON","BUS_SETUP_D",{"$f":"VLOOKUP(G6,List!B:C,2,0)","v":577},null,null,{"$f":"VLOOKUP(G6,List!B:E,4,0)","v":"dcsm-EF_BUS_MONI_ON"},{"$f":"VLOOKUP(G6,List!B:G,6,0)","v":20},{"$f":"C6-317/3600/24","v":"2021-08-14T09:24:43"},{"$f":"+\"0000    CALL \"&K6&\" -Run\"","v":"0000    CALL dcsm-EF_BUS_MONI_ON -Run"}]
[null,null,{"$f":"+D6","v":"2021-08-14T09:39:37"},{"$f":"C7+H7/3600/24","v":"2021-08-14T09:48:06"},null,"MDP ON","MDP_ON_D",{"$f":"VLOOKUP(G7,List!B:C,2,0)","v":509},null,null,{"$f":"VLOOKUP(G7,List!B:E,4,0)","v":"dcsm-EF_MDP_ON"},{"$f":"VLOOKUP(G7,List!B:G,6,0)","v":11},{"$f":"C7-317/3600/24","v":"2021-08-14T09:34:20"},{"$f":"+\"0000    CALL \"&K7&\" -Run\"","v":"0000    CALL dcsm-EF_MDP_ON -Run"}]
[null,null,{"$f":"D7","v":"2021-08-14T09:48:06"},{"$f":"C8+H8/3600/24","v":"2021-08-14T09:48:48"},null,null,"MDP_CRUISE_SET",{"$f":"VLOOKUP(G8,List!B:C,2,0)","v":42},null,null,{"$f":"VLOOKUP(G8,List!B:E,4,0)","v":"dcsm-EF_MDP_CRUISE_SET"},{"$f":"VLOOKUP(G8,List!B:G,6,0)","v":2},"2021-08-14T09:42:49","0000    CALL dcsm-EF_MDP_CRUISE_SET -Run"]
[null,null,{"$f":"D8","v":"2021-08-14T09:48:48"},"2021-08-14T09:49:30",null,"TLM mode change (MODE_10)","TLM_MODE_10",{"$f":"VLOOKUP(G9,List!B:C,2,0)","v":42},null,null,{"$f":"VLOOKUP(G9,List!B:E,4,0)","v":"dcsm-EF_BUS_TLM_MODE_10"},{"$f":"VLOOKUP(G9,List!B:G,6,0)","v":2},"2021-08-14T09:43:31","0000    CALL dcsm-EF_BUS_TLM_MODE_10 -Run"]
[null,null,"2021-08-14T09:49:30","2021-08-14T09:54:22",null,"SI Power ON","MEA1_ON_SETUP_SW",{"$f":"VLOOKUP(G10,List!B:C,2,0)","v":292},null,null,{"$f":"VLOOKUP(G10,List!B:E,4,0)","v":"dcsm-EF_MEA1_ON_SW"},{"$f":"VLOOKUP(G10,List!B:G,6,0)","v":12},"2021-08-14T09:44:13","0000    CALL dcsm-EF_MEA1_ON_SW -Run"]
[null,null,"2021-08-14T09:54:22","2021-08-14T10:14:52",null,null,"HEP_ON_SETUP",{"$f":"VLOOKUP(G11,List!B:C,2,0)","v":1230},null,null,{"$f":"VLOOKUP(G11,List!B:E,4,0)","v":"dcsm-EF_HEP_ON_START_for_TL"},{"$f":"VLOOKUP(G11,List!B:G,6,0)","v":34},"2021-08-14T09:49:05","0000    CALL dcsm-EF_HEP_ON_START_for_TL -Run"]
[null,null,"2021-08-14T10:14:52","2021-08-14T10:16:12",null,null,"PME_ON",{"$f":"VLOOKUP(G12,List!B:C,2,0)","v":80},null,null,{"$f":"VLOOKUP(G12,List!B:E,4,0)","v":"dcsm-EF_PME_ON"},{"$f":"VLOOKUP(G12,List!B:G,6,0)","v":2},"2021-08-14T10:09:35","0000    CALL dcsm-EF_PME_ON -Run"]
[null,null,"2021-08-14T10:16:12","2021-08-14T10:16:26",null,null,"MGF_ON_SETUP",{"$f":"VLOOKUP(G13,List!B:C,2,0)","v":14},null,null,{"$f":"VLOOKUP(G13,List!B:E,4,0)","v":"dcsm-EF_MGF_ON"},{"$f":"VLOOKUP(G13,List!B:G,6,0)","v":3},"2021-08-14T10:10:55","0000    CALL dcsm-EF_MGF_ON -Run"]
[null,null,"2021-08-14T10:16:26","2021-08-14T10:44:48",null,"SI HV ON","MEA1_HV_ON",{"$f":"VLOOKUP(G14,List!B:C,2,0)","v":1702},null,null,{"$f":"VLOOKUP(G14,List!B:E,4,0)","v":"dcsm-EF_MEA1_HV_ON"},{"$f":"VLOOKUP(G14,List!B:G,6,0)","v":27},"2021-08-14T10:11:09",{"$f":"+\"0000    CALL \"&K14&\" -Run\"","v":"0000    CALL dcsm-EF_MEA1_HV_ON -Run"}]
[null,null,"2021-08-14T10:44:48","2021-08-14T10:49:18",null,null,"HEP_HV_ON",{"$f":"VLOOKUP(G15,List!B:C,2,0)","v":270},null,null,{"$f":"VLOOKUP(G15,List!B:E,4,0)","v":"dcsm-EF_HEPE_HV_ON_OBS_START"},{"$f":"VLOOKUP(G15,List!B:G,6,0)","v":6},"2021-08-14T10:39:31",{"$f":"+\"0000    CALL \"&K15&\" -Run\"","v":"0000    CALL dcsm-EF_HEPE_HV_ON_OBS_START -Run"}]
[null,null,"2021-08-14T10:49:18","2021-08-14T10:50:00",null,"TLM mode change (MODE_5)","TLM_MODE_5",{"$f":"VLOOKUP(G16,List!B:C,2,0)","v":42},"Mission: 7kbps, without user HK",null,{"$f":"VLOOKUP(G16,List!B:E,4,0)","v":"dcsm-EF_BUS_TLM_MODE_5"},{"$f":"VLOOKUP(G16,List!B:G,6,0)","v":2},"2021-08-14T10:44:01","0000    CALL dcsm-EF_BUS_TLM_MODE_5 -Run"]
[null,null,"2021-08-14T10:50:00",{"$f":"C18","v":"2021-08-15T05:34:39"},"Observation A",null,null,{"$f":"(D17-C17)*3600*24","v":67479.000001377426},{"$f":"H17/3600","v":18.744166667049285},null,"",0,"2021-08-14T10:44:43",{"$f":"\"0000    WAIT_SEC  \"&TEXT(H17,\"#0\")","v":"0000    WAIT_SEC  67479"}]
[null,null,{"$f":"D18-H18/3600/24","v":"2021-08-15T05:34:39"},{"$f":"C19","v":"2021-08-15T05:35:21"},null,"TLM mode change (MODE_10)","TLM_MODE_10",{"$f":"VLOOKUP(G18,List!B:C,2,0)","v":42},"Mission: 4kbps, with user HK",null,{"$f":"VLOOKUP(G18,List!B:E,4,0)","v":"dcsm-EF_BUS_TLM_MODE_10"},{"$f":"VLOOKUP(G18,List!B:G,6,0)","v":2},"2021-08-15T05:29:22","0000    CALL dcsm-EF_BUS_TLM_MODE_10 -Run"]
[null,null,{"$f":"D19-H19/3600/24","v":"2021-08-15T05:35:21"},{"$f":"C20","v":"2021-08-15T05:38:31"},null,"SI HV OFF","HEP_HV_OFF",{"$f":"VLOOKUP(G19,List!B:C,2,0)","v":190},null,null,{"$f":"VLOOKUP(G19,List!B:E,4,0)","v":"dcsm-EF_HEPE_HV_OFF_OBS_OFF"},{"$f":"VLOOKUP(G19,List!B:G,6,0)","v":5},"2021-08-15T05:30:04","0000    CALL dcsm-EF_HEPE_HV_OFF_OBS_OFF -Run"]
[null,null,{"$f":"D20-H20/3600/24","v":"2021-08-15T05:38:31"},{"$f":"C21","v":"2021-08-15T05:41:33"},null,null,"MEA1_HV_OFF",{"$f":"VLOOKUP(G20,List!B:C,2,0)","v":182},null,null,{"$f":"VLOOKUP(G20,List!B:E,4,0)","v":"dcsm-EF_MEA1_HV_OFF"},{"$f":"VLOOKUP(G20,List!B:G,6,0)","v":10},"2021-08-15T05:33:14","0000    CALL dcsm-EF_MEA1_HV_OFF -Run"]
[null,null,"2021-08-15T05:41:33",{"$f":"C21+H21/3600/24","v":"2021-08-15T06:01:33"},"WOL#1",null,{"$f":"(C22-D20)*24*3600","v":1800.0000002095476},1200,null,null,null,0,"2021-08-15T05:36:16",{"$f":"\"0000    WAIT_SEC  \"&TEXT(G21,\"#0\")","v":"0000    WAIT_SEC  1800"}]
[null,null,{"$f":"D21+10/60/24","v":"2021-08-15T06:11:33"},{"$f":"C22+H22/3600/24","v":"2021-08-15T06:39:55"},null,"SI HV ON","MEA1_HV_ON",{"$f":"VLOOKUP(G22,List!B:C,2,0)","v":1702},null,null,{"$f":"VLOOKUP(G22,List!B:E,4,0)","v":"dcsm-EF_MEA1_HV_ON"},{"$f":"VLOOKUP(G22,List!B:G,6,0)","v":27},"2021-08-15T06:06:16",{"$f":"+\"0000    CALL \"&K22&\" -Run\"","v":"0000    CALL dcsm-EF_MEA1_HV_ON -Run"}]
[null,null,{"$f":"D22","v":"2021-08-15T06:39:55"},"2021-08-15T06:44:25",null,null,"HEP_HV_ON",{"$f":"VLOOKUP(G23,List!B:C,2,0)","v":270},null,null,{"$f":"VLOOKUP(G23,List!B:E,4,0)","v":"dcsm-EF_HEPE_HV_ON_OBS_START"},{"$f":"VLOOKUP(G23,List!B:G,6,0)","v":6},"2021-08-15T06:34:38",{"$f":"+\"0000    CALL \"&K23&\" -Run\"","v":"0000    CALL dcsm-EF_HEPE_HV_ON_OBS_START -Run"}]
[null,null,"2021-08-15T06:44:25","2021-08-15T06:45:07",null,"TLM mode change (MODE_5)","TLM_MODE_5",{"$f":"VLOOKUP(G24,List!B:C,2,0)","v":42},"Mission: 7kbps, without user HK",null,{"$f":"VLOOKUP(G24,List!B:E,4,0)","v":"dcsm-EF_BUS_TLM_MODE_5"},{"$f":"VLOOKUP(G24,List!B:G,6,0)","v":2},"2021-08-15T06:39:08","0000    CALL dcsm-EF_BUS_TLM_MODE_5 -Run"]
[null,null,"2021-08-15T06:45:07",{"$f":"C26","v":"2021-08-16T05:36:02"},"Observation B",null,null,{"$f":"(D25-C25)*3600*24","v":82255.000000423752},{"$f":"H25/3600","v":22.84861111122882},null,"",0,"2021-08-15T06:39:50",{"$f":"\"0000    WAIT_SEC  \"&TEXT(H25,\"#0\")","v":"0000    WAIT_SEC  82255"}]
[null,null,{"$f":"D26-H26/3600/24","v":"2021-08-16T05:36:02"},{"$f":"C27","v":"2021-08-16T05:36:44"},null,"TLM mode change (MODE_10)","TLM_MODE_10",{"$f":"VLOOKUP(G26,List!B:C,2,0)","v":42},"Mission: 4kbps, with user HK",null,{"$f":"VLOOKUP(G26,List!B:E,4,0)","v":"dcsm-EF_BUS_TLM_MODE_10"},{"$f":"VLOOKUP(G26,List!B:G,6,0)","v":2},"2021-08-16T05:30:45","0000    CALL dcsm-EF_BUS_TLM_MODE_10 -Run"]
[null,null,{"$f":"D27-H27/3600/24","v":"2021-08-16T05:36:44"},{"$f":"C28","v":"2021-08-16T05:39:54"},null,"SI HV OFF","HEP_HV_OFF",{"$f":"VLOOKUP(G27,List!B:C,2,0)","v":190},null,null,{"$f":"VLOOKUP(G27,List!B:E,4,0)","v":"dcsm-EF_HEPE_HV_OFF_OBS_OFF"},{"$f":"VLOOKUP(G27,List!B:G,6,0)","v":5},"2021-08-16T05:31:27","0000    CALL dcsm-EF_HEPE_HV_OFF_OBS_OFF -Run"]
[null,null,{"$f":"D28-H28/3600/24","v":"2021-08-16T05:39:54"},{"$f":"C29","v":"2021-08-16T05:42:56"},null,null,"MEA1_HV_OFF",{"$f":"VLOOKUP(G28,List!B:C,2,0)","v":182},null,null,{"$f":"VLOOKUP(G28,List!B:E,4,0)","v":"dcsm-EF_MEA1_HV_OFF"},{"$f":"VLOOKUP(G28,List!B:G,6,0)","v":10},"2021-08-16T05:34:37","0000    CALL dcsm-EF_MEA1_HV_OFF -Run"]
[null,null,"2021-08-16T05:42:56",{"$f":"C29+H29/3600/24","v":"2021-08-16T06:02:56"},"WOL#2",null,{"$f":"(C30-D28)*24*3600","v":1800.0000002095476},1200,null,null,null,0,"2021-08-16T05:37:39",{"$f":"\"0000    WAIT_SEC  \"&TEXT(G29,\"#0\")","v":"0000    WAIT_SEC  1800"}]
[null,null,{"$f":"D29+10/60/24","v":"2021-08-16T06:12:56"},{"$f":"C30+H30/3600/24","v":"2021-08-16T06:41:18"},null,"SI HV ON","MEA1_HV_ON",{"$f":"VLOOKUP(G30,List!B:C,2,0)","v":1702},null,null,{"$f":"VLOOKUP(G30,List!B:E,4,0)","v":"dcsm-EF_MEA1_HV_ON"},{"$f":"VLOOKUP(G30,List!B:G,6,0)","v":27},"2021-08-16T06:07:39",{"$f":"+\"0000    CALL \"&K30&\" -Run\"","v":"0000    CALL dcsm-EF_MEA1_HV_ON -Run"}]
[null,null,{"$f":"D30","v":"2021-08-16T06:41:18"},"2021-08-16T06:45:48",null,null,"HEP_HV_ON",{"$f":"VLOOKUP(G31,List!B:C,2,0)","v":270},null,null,{"$f":"VLOOKUP(G31,List!B:E,4,0)","v":"dcsm-EF_HEPE_HV_ON_OBS_START"},{"$f":"VLOOKUP(G31,List!B:G,6,0)","v":6},"2021-08-16T06:36:01",{"$f":"+\"0000    CALL \"&K31&\" -Run\"","v":"0000    CALL dcsm-EF_HEPE_HV_ON_OBS_START -Run"}]
[null,null,"2021-08-16T06:45:48","2021-08-16T06:46:30",null,"TLM mode change (MODE_5)","TLM_MODE_5",{"$f":"VLOOKUP(G32,List!B:C,2,0)","v":42},"Mission: 7kbps, without user HK",null,{"$f":"VLOOKUP(G32,List!B:E,4,0)","v":"dcsm-EF_BUS_TLM_MODE_5"},{"$f":"VLOOKUP(G32,List!B:G,6,0)","v":2},"2021-08-16T06:40:31","0000    CALL dcsm-EF_BUS_TLM_MODE_5 -Run"]
[null,null,"2021-08-16T06:46:30",{"$f":"C34","v":"2021-08-17T05:35:16"},"Observation C",null,null,{"$f":"(D33-C33)*3600*24","v":82126.00000044331},{"$f":"H33/3600","v":22.812777777900919},null,"",0,"2021-08-16T06:41:13",{"$f":"\"0000    WAIT_SEC  \"&TEXT(H33,\"#0\")","v":"0000    WAIT_SEC  82126"}]
[null,null,{"$f":"D34-H34/3600/24","v":"2021-08-17T05:35:16"},{"$f":"C35","v":"2021-08-17T05:35:58"},null,"TLM mode change (MODE_10)","TLM_MODE_10",{"$f":"VLOOKUP(G34,List!B:C,2,0)","v":42},"Mission: 4kbps, with user HK",null,{"$f":"VLOOKUP(G34,List!B:E,4,0)","v":"dcsm-EF_BUS_TLM_MODE_10"},{"$f":"VLOOKUP(G34,List!B:G,6,0)","v":2},"2021-08-17T05:29:59","0000    CALL dcsm-EF_BUS_TLM_MODE_10 -Run"]
[null,null,{"$f":"D35-H35/3600/24","v":"2021-08-17T05:35:58"},{"$f":"C36","v":"2021-08-17T05:39:08"},null,"SI HV OFF","HEP_HV_OFF",{"$f":"VLOOKUP(G35,List!B:C,2,0)","v":190},null,null,{"$f":"VLOOKUP(G35,List!B:E,4,0)","v":"dcsm-EF_HEPE_HV_OFF_OBS_OFF"},{"$f":"VLOOKUP(G35,List!B:G,6,0)","v":5},"2021-08-17T05:30:41","0000    CALL dcsm-EF_HEPE_HV_OFF_OBS_OFF -Run"]
[null,null,{"$f":"D36-H36/3600/24","v":"2021-08-17T05:39:08"},{"$f":"C37","v":"2021-08-17T05:42:10"},null,null,"MEA1_HV_OFF",{"$f":"VLOOKUP(G36,List!B:C,2,0)","v":182},null,null,{"$f":"VLOOKUP(G36,List!B:E,4,0)","v":"dcsm-EF_MEA1_HV_OFF"},{"$f":"VLOOKUP(G36,List!B:G,6,0)","v":10},"2021-08-17T05:33:51","0000    CALL dcsm-EF_MEA1_HV_OFF -Run"]
[null,null,"2021-08-17T05:42:10",{"$f":"C37+H37/3600/24","v":"2021-08-17T06:02:10"},"WOL#3",null,{"$f":"(C38-D36)*24*3600","v":1800.0000002095476},1200,null,null,null,0,"2021-08-17T05:36:53",{"$f":"\"0000    WAIT_SEC  \"&TEXT(G37,\"#0\")","v":"0000    WAIT_SEC  1800"}]
[null,null,{"$f":"D37+10/60/24","v":"2021-08-17T06:12:10"},{"$f":"C38+H38/3600/24","v":"2021-08-17T06:40:32"},null,"SI HV ON","MEA1_HV_ON",{"$f":"VLOOKUP(G38,List!B:C,2,0)","v":1702},null,null,{"$f":"VLOOKUP(G38,List!B:E,4,0)","v":"dcsm-EF_MEA1_HV_ON"},{"$f":"VLOOKUP(G38,List!B:G,6,0)","v":27},"2021-08-17T06:06:53",{"$f":"+\"0000    CALL \"&K38&\" -Run\"","v":"0000    CALL dcsm-EF_MEA1_HV_ON -Run"}]
[null,null,{"$f":"D38","v":"2021-08-17T06:40:32"},"2021-08-17T06:45:02",null,null,"HEP_HV_ON",{"$f":"VLOOKUP(G39,List!B:C,2,0)","v":270},null,null,{"$f":"VLOOKUP(G39,List!B:E,4,0)","v":"dcsm-EF_HEPE_HV_ON_OBS_START"},{"$f":"VLOOKUP(G39,List!B:G,6,0)","v":6},"2021-08-17T06:35:15",{"$f":"+\"0000    CALL \"&K39&\" -Run\"","v":"0000    CALL dcsm-EF_HEPE_HV_ON_OBS_START -Run"}]
[null,null,"2021-08-17T06:45:02","2021-08-17T06:45:44",null,"TLM mode change (MODE_5)","TLM_MODE_5",{"$f":"VLOOKUP(G40,List!B:C,2,0)","v":42},"Mission: 7kbps, without user HK",null,{"$f":"VLOOKUP(G40,List!B:E,4,0)","v":"dcsm-EF_BUS_TLM_MODE_5"},{"$f":"VLOOKUP(G40,List!B:G,6,0)","v":2},"2021-08-17T06:39:45","0000    CALL dcsm-EF_BUS_TLM_MODE_5 -Run"]
[null,null,"2021-08-17T06:45:44",{"$f":"C42","v":"2021-08-18T05:37:31"},"Observation D",null,null,{"$f":"(D41-C41)*3600*24","v":82307.000000635162},{"$f":"H41/3600","v":22.863055555731989},null,"",0,"2021-08-17T06:40:27",{"$f":"\"0000    WAIT_SEC  \"&TEXT(H41,\"#0\")","v":"0000    WAIT_SEC  82307"}]
[null,null,{"$f":"D42-H42/3600/24","v":"2021-08-18T05:37:31"},{"$f":"C43","v":"2021-08-18T05:38:13"},null,"TLM mode change (MODE_10)","TLM_MODE_10",{"$f":"VLOOKUP(G42,List!B:C,2,0)","v":42},"Mission: 4kbps, with user HK",null,{"$f":"VLOOKUP(G42,List!B:E,4,0)","v":"dcsm-EF_BUS_TLM_MODE_10"},{"$f":"VLOOKUP(G42,List!B:G,6,0)","v":2},"2021-08-18T05:32:14","0000    CALL dcsm-EF_BUS_TLM_MODE_10 -Run"]
[null,null,{"$f":"D43-H43/3600/24","v":"2021-08-18T05:38:13"},{"$f":"C44","v":"2021-08-18T05:41:23"},null,"SI HV OFF","HEP_HV_OFF",{"$f":"VLOOKUP(G43,List!B:C,2,0)","v":190},null,null,{"$f":"VLOOKUP(G43,List!B:E,4,0)","v":"dcsm-EF_HEPE_HV_OFF_OBS_OFF"},{"$f":"VLOOKUP(G43,List!B:G,6,0)","v":5},"2021-08-18T05:32:56","0000    CALL dcsm-EF_HEPE_HV_OFF_OBS_OFF -Run"]
[null,null,{"$f":"D44-H44/3600/24","v":"2021-08-18T05:41:23"},{"$f":"C45","v":"2021-08-18T05:44:25"},null,null,"MEA1_HV_OFF",{"$f":"VLOOKUP(G44,List!B:C,2,0)","v":182},null,null,{"$f":"VLOOKUP(G44,List!B:E,4,0)","v":"dcsm-EF_MEA1_HV_OFF"},{"$f":"VLOOKUP(G44,List!B:G,6,0)","v":10},"2021-08-18T05:36:06","0000    CALL dcsm-EF_MEA1_HV_OFF -Run"]
[null,null,"2021-08-18T05:44:25",{"$f":"C45+H45/3600/24","v":"2021-08-18T06:04:25"},"WOL#4",null,{"$f":"(C46-D44)*24*3600","v":1800.0000002095476},1200,null,null,null,0,"2021-08-18T05:39:08",{"$f":"\"0000    WAIT_SEC  \"&TEXT(G45,\"#0\")","v":"0000    WAIT_SEC  1800"}]
[null,null,{"$f":"D45+10/60/24","v":"2021-08-18T06:14:25"},{"$f":"C46+H46/3600/24","v":"2021-08-18T06:42:47"},null,"SI HV ON","MEA1_HV_ON",{"$f":"VLOOKUP(G46,List!B:C,2,0)","v":1702},null,null,{"$f":"VLOOKUP(G46,List!B:E,4,0)","v":"dcsm-EF_MEA1_HV_ON"},{"$f":"VLOOKUP(G46,List!B:G,6,0)","v":27},"2021-08-18T06:09:08",{"$f":"+\"0000    CALL \"&K46&\" -Run\"","v":"0000    CALL dcsm-EF_MEA1_HV_ON -Run"}]
[null,null,{"$f":"D46","v":"2021-08-18T06:42:47"},"2021-08-18T06:47:17",null,null,"HEP_HV_ON",{"$f":"VLOOKUP(G47,List!B:C,2,0)","v":270},null,null,{"$f":"VLOOKUP(G47,List!B:E,4,0)","v":"dcsm-EF_HEPE_HV_ON_OBS_START"},{"$f":"VLOOKUP(G47,List!B:G,6,0)","v":6},"2021-08-18T06:37:30",{"$f":"+\"0000    CALL \"&K47&\" -Run\"","v":"0000    CALL dcsm-EF_HEPE_HV_ON_OBS_START -Run"}]
[null,null,"2021-08-18T06:47:17","2021-08-18T06:47:59",null,"TLM mode change (MODE_5)","TLM_MODE_5",{"$f":"VLOOKUP(G48,List!B:C,2,0)","v":42},"Mission: 7kbps, without user HK",null,{"$f":"VLOOKUP(G48,List!B:E,4,0)","v":"dcsm-EF_BUS_TLM_MODE_5"},{"$f":"VLOOKUP(G48,List!B:G,6,0)","v":2},"2021-08-18T06:42:00","0000    CALL dcsm-EF_BUS_TLM_MODE_5 -Run"]
[null,null,"2021-08-18T06:47:59",{"$f":"C50","v":"2021-08-19T05:08:38"},"Observation E",null,null,{"$f":"(D49-C49)*3600*24","v":80438.999999617226},{"$f":"H49/3600","v":22.344166666560341},null,"",0,"2021-08-18T06:42:42",{"$f":"\"0000    WAIT_SEC  \"&TEXT(H49,\"#0\")","v":"0000    WAIT_SEC  80439"}]
[null,null,{"$f":"D50-H50/3600/24","v":"2021-08-19T05:08:38"},{"$f":"C51","v":"2021-08-19T05:09:20"},null,"TLM mode change (MODE_10)","TLM_MODE_10",{"$f":"VLOOKUP(G50,List!B:C,2,0)","v":42},"Mission: 4kbps, with user HK",null,{"$f":"VLOOKUP(G50,List!B:E,4,0)","v":"dcsm-EF_BUS_TLM_MODE_10"},{"$f":"VLOOKUP(G50,List!B:G,6,0)","v":2},"2021-08-19T05:03:21","0000    CALL dcsm-EF_BUS_TLM_MODE_10 -Run"]
[null,null,{"$f":"D51-H51/3600/24","v":"2021-08-19T05:09:20"},{"$f":"C52","v":"2021-08-19T05:12:30"},null,"SI HV OFF","HEP_HV_OFF",{"$f":"VLOOKUP(G51,List!B:C,2,0)","v":190},null,null,{"$f":"VLOOKUP(G51,List!B:E,4,0)","v":"dcsm-EF_HEPE_HV_OFF_OBS_OFF"},{"$f":"VLOOKUP(G51,List!B:G,6,0)","v":5},"2021-08-19T05:04:03","0000    CALL dcsm-EF_HEPE_HV_OFF_OBS_OFF -Run"]
[null,null,{"$f":"D52-H52/3600/24","v":"2021-08-19T05:12:30"},{"$f":"C53","v":"2021-08-19T05:15:36"},null,null,"MEA1_HV_SCAN_OFF",{"$f":"VLOOKUP(G52,List!B:C,2,0)","v":186},null,null,{"$f":"VLOOKUP(G52,List!B:E,4,0)","v":"dcsm-EF_MEA1_HV_SCAN_OFF"},{"$f":"VLOOKUP(G52,List!B:G,6,0)","v":12},"2021-08-19T05:07:13","0000    CALL dcsm-EF_MEA1_HV_SCAN_OFF -Run"]
[null,null,{"$f":"D53-H53/3600/24","v":"2021-08-19T05:15:36"},{"$f":"C54","v":"2021-08-19T05:16:46"},null,"SI OFF","HEP_OFF",{"$f":"VLOOKUP(G53,List!B:C,2,0)","v":70},null,null,{"$f":"VLOOKUP(G53,List!B:E,4,0)","v":"dcsm-EF_HEPE_OFF_STOP"},{"$f":"VLOOKUP(G53,List!B:G,6,0)","v":4},"2021-08-19T05:10:19",{"$f":"+\"0000    CALL \"&K53&\" -Run\"","v":"0000    CALL dcsm-EF_HEPE_OFF_STOP -Run"}]
[null,null,"2021-08-19T05:16:46","2021-08-19T05:19:26",null,null,"MEA1_OFF",{"$f":"VLOOKUP(G54,List!B:C,2,0)","v":160},null,null,{"$f":"VLOOKUP(G54,List!B:E,4,0)","v":"dcsm-EF_MEA1_OFF"},{"$f":"VLOOKUP(G54,List!B:G,6,0)","v":4},"2021-08-19T05:11:29",{"$f":"+\"0000    CALL \"&K54&\" -Run\"","v":"0000    CALL dcsm-EF_MEA1_OFF -Run"}]
[null,null,"2021-08-19T05:19:26","2021-08-19T05:19:34",null,null,"MGF_OFF",{"$f":"VLOOKUP(G55,List!B:C,2,0)","v":8},null,null,{"$f":"VLOOKUP(G55,List!B:E,4,0)","v":"dcsm-EF_MGF_OFF"},{"$f":"VLOOKUP(G55,List!B:G,6,0)","v":1},"2021-08-19T05:14:09","0000    CALL dcsm-EF_MGF_OFF -Run"]
[null,null,"2021-08-19T05:19:34","2021-08-19T05:20:14",null,null,"PME_OFF",{"$f":"VLOOKUP(G56,List!B:C,2,0)","v":40},null,null,{"$f":"VLOOKUP(G56,List!B:E,4,0)","v":"dcsm-EF_PME_OFF"},{"$f":"VLOOKUP(G56,List!B:G,6,0)","v":1},"2021-08-19T05:14:17","0000    CALL dcsm-EF_PME_OFF -Run"]
[null,null,"2021-08-19T05:20:14","2021-08-19T05:22:14",null,"MDP OFF","MDP_OFF_D",{"$f":"VLOOKUP(G57,List!B:C,2,0)","v":120},null,null,{"$f":"VLOOKUP(G57,List!B:E,4,0)","v":"dcsm-EF_MDP_POWEROFF"},{"$f":"VLOOKUP(G57,List!B:G,6,0)","v":3},"2021-08-19T05:14:57","0000    CALL dcsm-EF_MDP_POWEROFF -Run"]
[null,null,"2021-08-19T05:22:14","2021-08-19T05:26:20",null,"MACRO ENA","MC_ENA",{"$f":"VLOOKUP(G58,List!B:C,2,0)","v":246},null,null,{"$f":"VLOOKUP(G58,List!B:E,4,0)","v":"dcsm-MC_ENA_MDP"},{"$f":"VLOOKUP(G58,List!B:G,6,0)","v":21},"2021-08-19T05:16:57","0000    CALL dcsm-MC_ENA_MDP -Run"]
[null,null,"2021-08-19T05:26:20",{"$f":"C60","v":"2021-08-19T05:30:00"},null,"BUS OFF","BUS_OFF_D",{"$f":"VLOOKUP(G59,List!B:C,2,0)","v":220},null,null,{"$f":"VLOOKUP(G59,List!B:E,4,0)","v":"dcsm-EF_BUS_MONI_OFF"},{"$f":"VLOOKUP(G59,List!B:G,6,0)","v":5},"2021-08-19T05:21:03","0000    CALL dcsm-EF_BUS_MONI_OFF -Run"]
[null,null,"2021-08-19T05:30:00",{"$f":"C60+H60/3600/24","v":"2021-08-19T05:50:00"},null,null,"END",1200,null,null,null,0,"2021-08-19T05:24:43"]
[null,null,null,{"$f":"D59-100/3600/24","v":"2021-08-19T05:28:20"},null,null,null,null,null,null,null,null,{"$f":"D61-317/3600/24","v":"2021-08-19T05:23:03"}]