{"text_format":"1","workbook":"xlsx","n_sheets":11,"sheets":["確認事項","変更履歴","実行","チェック表","START","END","LOOP","COMMENT","List","WOL","obs_sequence"],"not_rendered":{"charts":0,"images":0,"macros":1,"external_links":0,"defined_names":5,"comments":0,"pivot_tables":0},"unopened":[],"bounds":{"document_bytes":16777216,"sheet_cells":100000,"rows_first":2000,"rows_last":500,"rows_between":2000,"halvings":0,"cell_chars":16384,"cell_head_chars":4096},"cells_cut":0,"cells_raw":0,"read":"whole","date_system":"1900"}

{"sheet":"確認事項","index":0,"n_rows":1,"n_cols":4,"rows_kept":1,"cut":false,"hidden":false,"merged":[]}
["NO.","確認事項","回答","CLOSE"]

{"sheet":"変更履歴","index":1,"n_rows":9,"n_cols":4,"rows_kept":9,"cut":false,"hidden":false,"merged":[[0,0,0,3]]}
["MMO観測計画作成ツール　変更履歴"]
["日付","Ver","変更者","変更内容"]
["2021-08-06",1,"山下","-"]
["2021-08-09",2,"arare","コマンド出力のmain　end部分を出力するように修正した\nListにMSA_HV_ON_VFB1、MSA_HV_ON_VFB2追加\nObs_sequence XOR Time行追記\nコマンドの開始終了時間をOBS時間に変更"]
["2021-08-17",3,"arare","WOLの時間をG列から取得するように変更"]
["2021-08-25",4,"arare","COMMENTにmainstart,endのXDOR,XOR用追記"]
["2021-09-27",5,"arare","＃refの対応 obserbation Aから昇順につける"]
["2021-10-19",6,"arare","ListにMSAHV追記"]
["2021-10-21",7,"arare","Listを最新にした"]

{"sheet":"実行","index":2,"n_rows":16,"n_cols":6,"rows_kept":16,"cut":false,"hidden":false,"merged":[]}
[]
[]
[]
[]
[]
[]
[]
[null,null,null,null,null,"【操作】"]
["C番号",987,null,null,null,"「実行」シートの「観測作成」を押下。"]
["M番号",631202,null,null,null,"→「START」、「LOOP」、「END」を「obs_sequence」に貼り付けます。"]
[null,null,null,null,null,"「実行」シートの「時刻反映」を押下。"]
[null,null,null,null,null,"→WOLの時間と関数エラーとなっているセルを修正します。"]
[null,null,null,null,null,"【注意点】"]
[null,null,null,null,null,"「START」、「LOOP」、「END」の\"cmd count\"からシート内に何行あるかを取得しているので、ここは空白がないように\"0”を入力してください。"]
[null,null,null,null,null,"もし空白があった場合、コピー範囲が小さくなってしまいます。"]
{"$rows_left_out":2}
{"sheet":"チェック表","index":3,"n_rows":19,"n_cols":4,"rows_kept":19,"cut":false,"hidden":true,"merged":[]}
[]
[null,"コマンド作成時注意項目"]
[null,"NO.","項目","チェック"]
[null,1,"\n観測期間開始時に「dcsm-EF_BUS_MONI_ON」手順が入っていることを確認する。\nただし、前回の観測終了時に「dcsm-EF_BUS_MONI_OFF」を実行していない場合は確認不要。\n","□"]
[null,2,"\n観測期間開始日に、観測する機器の”ON”手順が入っていることを確認する。\nただし、PWI、MGF、MAST、WPTを\"ON\"にする場合は、PWI、MGF、MAST、WPTよりも先にPMEが\"ON\"となっていること。\n※クルーズ観測中は、MEA1,HEPE,MGFのみ”ON”\n","□"]
[null,3,"\nTLM MODEが観測前に「５」　観測終了後は「１０」　となっていることを確認する\n","□"]
[null,4,"\n観測時間が”86400”を超えるていないか確認する。\n超えていた場合は、main計画作成時に途中ダミーコマンドを挿入すること\n"]
[null,5,"WOLの開始時刻が正しいことを確認する","□"]
[null,6,"\nWOLの時間を確認　HV　OFFになっていることを確認する\n↓\nクルーズ観測を行っている機器(HEPE、ENA、MIA、MEA、MSAのみ)\nフライバイを行っている機器(MSA,PWI,MGF,MEA,ENA,MIA,HEPE,MDM)\n","□"]
[null,7,"\nWOL終了時刻＋10以降にのHVがONになっていることを確認する。\nクルーズ観測を行っている機器(HEPE、ENA、MIA、MEA、MSAのみ)\nフライバイを行っている機器(MSA,PWI,MGF,MEA,ENA,MIA,HEPE,MDM)\n","□"]
[null,8,"\n観測期間最終日に、観測を行った機器の”OFF”手順が入っていることを確認する。\nただし、PWI,MGF,MAST,WPT-OFF手順の後にPME-OFF手順が入っていることを確認する。\n","□"]
[null,9,"\nMDP_POWEROFFのあとにdcsm-MC_ENA_MDPが入っていることを確認する。\n","□"]
[null,10,"\nCELのMONI ONは長時間(1h以上の場合は、山下さんと要相談)しないこと　\nBUSにはCELのみのもあるので注意　dcsm-BUS_CEL_MONI_ON　dcsm-BUS_CEL_MONI_OFF\n","□"]
[null,11,"MEA1の  SCAN ON は　dcsm-EF_MEA1_ON_SW.cpsに入っているので\n　　　順番は　MDP ONして\n　　　　　　　dcsm-EF_MEA1_ON_SW.cps\n　　　　　　　dcsm-EF_MEA1_HV_ON.cps\n　　　　　　　dcsm-EF_MEA1_HV_OFF.cps\n　　　　　　　dcsm-EF_MEA1_HV_ON.cps\n　　　　　　　dcsm-EF_MEA1_HV_SCAN_OFF.cps\n　　　　　　　dcsm-EF_MEA1_OFF.cps\n　　　　　　　MDP　OFF\n　　　　　　　\n  　　　　　　dcsm-EF_MEA_ON_SW.cps\n　　　　　　　dcsm-EF_MEA_HV_ON.cps\n　　　　　　　dcsm-EF_MEA_HV_OFF.cps\n　　　　　　　dcsm-EF_MEA_HV_ON.cps\n　　　　　　　dcsm-EF_MEA_HV_SCAN_OFF.cps\n　　　　　　　dcsm-EF_MEA_OFF.cps\n\n　　　になる\n　SCAN OFFにすると　データが出てこない　HV OFF->ON時は注意する","□"]
[null,13,"2021/6/25以降　dcsm-EF_MSA_ON_C　が最新　dcsm-EF_MSA_ONは使用しない","□"]
{"$rows_left_out":5}
{"sheet":"START","index":4,"n_rows":6,"n_cols":21,"rows_kept":6,"cut":false,"hidden":false,"merged":[[1,5,5,5]]}
["Start","End","Start","End","Event","Activity","Procedure","Duration (sec)",null,null,null,"cmd count",null,"cmd count"]
[null,null,{"$f":"#REF!","v":{"$error":"#REF!"}},{"$f":"C2+H2/3600/24","v":{"$error":"#REF!"}},null,"SI Power ON","MEA1_ON_SETUP_SW",{"$f":"VLOOKUP(G2,List!B:C,2,0)","v":292},null,null,{"$f":"VLOOKUP(G2,List!B:E,4,0)","v":"dcsm-EF_MEA1_ON_SW"},{"$f":"VLOOKUP(G2,List!B:G,6,0)","v":12},{"$f":"C2-317/3600/24","v":{"$error":"#REF!"}},{"$f":"+\"0000    CALL \"&K2&\" -Run\"","v":"0000    CALL dcsm-EF_MEA1_ON_SW -Run"},null,"CALL","dcsm-EF_BUS_MONI_ON",null,null,null,{"$f":"+IF(Q2=K2,\"\",\"x\")","v":"x"}]
[null,null,{"$f":"D2","v":{"$error":"#REF!"}},{"$f":"C3+H3/3600/24","v":{"$error":"#REF!"}},null,null,"HEP_ON_SETUP",{"$f":"VLOOKUP(G3,List!B:C,2,0)","v":1230},null,null,{"$f":"VLOOKUP(G3,List!B:E,4,0)","v":"dcsm-EF_HEP_ON_START_for_TL"},{"$f":"VLOOKUP(G3,List!B:G,6,0)","v":34},{"$error":"#REF!"},"0000    CALL dcsm-EF_HEP_ON_START_for_TL -Run",null,"CALL","dcsm-EF_MDP_ON",null,null,null,{"$f":"+IF(Q3=K3,\"\",\"x\")","v":"x"}]
[null,null,{"$f":"D3","v":{"$error":"#REF!"}},{"$f":"C4+H4/3600/24","v":{"$error":"#REF!"}},null,null,"PME_ON",{"$f":"VLOOKUP(G4,List!B:C,2,0)","v":80},null,null,{"$f":"VLOOKUP(G4,List!B:E,4,0)","v":"dcsm-EF_PME_ON"},{"$f":"VLOOKUP(G4,List!B:G,6,0)","v":2},{"$error":"#REF!"},"0000    CALL dcsm-EF_PME_ON -Run"]
[null,null,{"$error":"#REF!"},{"$error":"#REF!"},null,null,"MGF_ON_SETUP",{"$f":"VLOOKUP(G5,List!B:C,2,0)","v":14},null,null,{"$f":"VLOOKUP(G5,List!B:E,4,0)","v":"dcsm-EF_MGF_ON"},{"$f":"VLOOKUP(G5,List!B:G,6,0)","v":3},{"$error":"#REF!"},"0000    CALL dcsm-EF_MGF_ON -Run"]
[null,null,{"$error":"#REF!"},{"$f":"C6+H6/3600/24","v":{"$error":"#REF!"}},null,null,"MIA_ON_SETUP",{"$f":"VLOOKUP(G6,List!B:C,2,0)","v":382},null,null,{"$f":"VLOOKUP(G6,List!B:E,4,0)","v":"dcsm-EF_MIA_ON"},{"$f":"VLOOKUP(G6,List!B:G,6,0)","v":6},{"$error":"#REF!"},"0000    CALL dcsm-EF_MIA_ON -Run"]

{"sheet":"END","index":5,"n_rows":9,"n_cols":21,"rows_kept":9,"cut":false,"hidden":false,"merged":[[1,5,6,5]]}
["Start","End","Start","End","Event","Activity","Procedure","Duration (sec)",null,null,null,"cmd count",null,"cmd count"]
[null,null,{"$f":"D2-H2/3600/24","v":{"$error":"#REF!"}},{"$f":"C3","v":{"$error":"#REF!"}},null,"SI Power ON","HEP_OFF",{"$f":"VLOOKUP(G2,List!B:C,2,0)","v":70},null,null,{"$f":"VLOOKUP(G2,List!B:E,4,0)","v":"dcsm-EF_HEPE_OFF_STOP"},{"$f":"VLOOKUP(G2,List!B:G,6,0)","v":4},{"$f":"C2-317/3600/24","v":{"$error":"#REF!"}},{"$f":"+\"0000    CALL \"&K2&\" -Run\"","v":"0000    CALL dcsm-EF_HEPE_OFF_STOP -Run"},null,"CALL","dcsm-EF_HEPE_OFF_STOP",null,null,null,{"$f":"+IF(Q2=K2,\"\",\"x\")","v":""}]
[null,null,{"$error":"#REF!"},{"$f":"C4","v":{"$error":"#REF!"}},null,null,"MEA1_OFF",{"$f":"VLOOKUP(G3,List!B:C,2,0)","v":160},null,null,{"$f":"VLOOKUP(G3,List!B:E,4,0)","v":"dcsm-EF_MEA1_OFF"},{"$f":"VLOOKUP(G3,List!B:G,6,0)","v":4},{"$error":"#REF!"},{"$f":"+\"0000    CALL \"&K3&\" -Run\"","v":"0000    CALL dcsm-EF_MEA1_OFF -Run"},null,"CALL","dcsm-EF_MEA1_OFF",null,null,null,""]
[null,null,{"$error":"#REF!"},{"$error":"#REF!"},null,null,"MGF_OFF",{"$f":"VLOOKUP(G4,List!B:C,2,0)","v":8},null,null,{"$f":"VLOOKUP(G4,List!B:E,4,0)","v":"dcsm-EF_MGF_OFF"},{"$f":"VLOOKUP(G4,List!B:G,6,0)","v":1},{"$error":"#REF!"},"0000    CALL dcsm-EF_MGF_OFF -Run",null,"CALL","dcsm-EF_MGF_OFF",null,null,null,""]
[null,null,{"$error":"#REF!"},{"$error":"#REF!"},null,null,"PME_OFF",{"$f":"VLOOKUP(G5,List!B:C,2,0)","v":40},null,null,{"$f":"VLOOKUP(G5,List!B:E,4,0)","v":"dcsm-EF_PME_OFF"},{"$f":"VLOOKUP(G5,List!B:G,6,0)","v":1},{"$error":"#REF!"},"0000    CALL dcsm-EF_PME_OFF -Run",null,"CALL","dcsm-EF_PME_OFF",null,null,null,""]
[null,null,{"$error":"#REF!"},{"$f":"C7","v":{"$error":"#REF!"}},null,null,"MIA_OFF",{"$f":"VLOOKUP(G6,List!B:C,2,0)","v":160},null,null,{"$f":"VLOOKUP(G6,List!B:E,4,0)","v":"dcsm-EF_MIA_OFF"},{"$f":"VLOOKUP(G6,List!B:G,6,0)","v":4},{"$error":"#REF!"},"0000    CALL dcsm-EF_MIA_OFF -Run",null,"CALL","dcsm-EF_MDP_POWEROFF",null,null,null,"x"]
[null,null,{"$f":"D7-H7/3600/24","v":{"$error":"#REF!"}},{"$f":"C8","v":{"$error":"#REF!"}},null,null,"MSA_OFF",{"$f":"VLOOKUP(G7,List!B:C,2,0)","v":380},null,null,{"$f":"VLOOKUP(G7,List!B:E,4,0)","v":"dcsm-EF_MSA_OFF"},{"$f":"VLOOKUP(G7,List!B:G,6,0)","v":25},{"$f":"C7-317/3600/24","v":{"$error":"#REF!"}},"0000    CALL dcsm-EF_MSA_OFF -Run"]
[null,null,{"$error":"#REF!"},{"$f":"C9","v":{"$error":"#REF!"}},null,"MDP OFF","MDP_OFF_D",{"$f":"VLOOKUP(G8,List!B:C,2,0)","v":120},null,null,{"$f":"VLOOKUP(G8,List!B:E,4,0)","v":"dcsm-EF_MDP_POWEROFF"},{"$f":"VLOOKUP(G8,List!B:G,6,0)","v":3},{"$error":"#REF!"},"0000    CALL dcsm-EF_MDP_POWEROFF -Run",null,null,null,null,null,null,{"$f":"+IF(#REF!=K8,\"\",\"x\")","v":{"$error":"#REF!"}}]
[null,null,{"$f":"#REF!","v":{"$error":"#REF!"}},{"$f":"C9+H9/3600/24","v":{"$error":"#REF!"}},{"$f":"#REF!","v":{"$error":"#REF!"}},null,"END",1200,null,null,{"$f":"VLOOKUP(G9,List!B:E,4,0)","v":{"$error":"#N/A"}},{"$f":"VLOOKUP(G9,List!B:G,6,0)","v":{"$error":"#N/A"}},{"$error":"#REF!"}]

{"sheet":"LOOP","index":6,"n_rows":14,"n_cols":21,"rows_kept":14,"cut":false,"hidden":false,"merged":[[9,5,12,5],[1,5,5,5]]}
["Start","End","Start","End","Event","Activity","Procedure","Duration (sec)",null,null,null,"cmd count",null,"cmd count"]
[null,null,{"$f":"#REF!","v":{"$error":"#REF!"}},{"$f":"C2+H2/3600/24","v":{"$error":"#REF!"}},null,"SI HV ON","HEP_HV_ON",{"$f":"VLOOKUP(G2,List!B:C,2,0)","v":270},null,null,{"$f":"VLOOKUP(G2,List!B:E,4,0)","v":"dcsm-EF_HEPE_HV_ON_OBS_START"},{"$f":"VLOOKUP(G2,List!B:G,6,0)","v":6},{"$f":"C2-317/3600/24","v":{"$error":"#REF!"}},{"$f":"+\"0000    CALL \"&K2&\" -Run\"","v":"0000    CALL dcsm-EF_HEPE_HV_ON_OBS_START -Run"},null,"CALL","dcsm-EF_MEA1_HV_ON",null,null,null,{"$f":"+IF(Q2=K2,\"\",\"x\")","v":"x"}]
[null,null,{"$f":"D2","v":{"$error":"#REF!"}},{"$error":"#REF!"},null,null,"MIA_HV_ON_SW_RC",{"$f":"VLOOKUP(G3,List!B:C,2,0)","v":262},null,null,{"$f":"VLOOKUP(G3,List!B:E,4,0)","v":"dcsm-EF_MIA_HV_ON_SW_RC"},{"$f":"VLOOKUP(G3,List!B:G,6,0)","v":7},{"$error":"#REF!"},{"$f":"+\"0000    CALL \"&K3&\" -Run\"","v":"0000    CALL dcsm-EF_MIA_HV_ON_SW_RC -Run"},null,"CALL","dcsm-EF_HEPE_HV_ON_OBS_START",null,null,null,"x"]
[null,null,{"$f":"D3","v":{"$error":"#REF!"}},{"$f":"C4+H4/3600/24","v":{"$error":"#REF!"}},null,null,"MEA1_HV_ON",{"$f":"VLOOKUP(G4,List!B:C,2,0)","v":1702},null,null,{"$f":"VLOOKUP(G4,List!B:E,4,0)","v":"dcsm-EF_MEA1_HV_ON"},{"$f":"VLOOKUP(G4,List!B:G,6,0)","v":27},{"$f":"C4-317/3600/24","v":{"$error":"#REF!"}},{"$f":"+\"0000    CALL \"&K4&\" -Run\"","v":"0000    CALL dcsm-EF_MEA1_HV_ON -Run"},null,"CALL","dcsm-EF_HEPE_HV_ON_OBS_START",null,null,null,{"$f":"+IF(Q4=K4,\"\",\"x\")","v":"x"}]
[null,null,{"$error":"#REF!"},{"$error":"#REF!"},null,null,"MSA_HV_ON_1_MFB_SF",{"$f":"VLOOKUP(G5,List!B:C,2,0)","v":1573},null,null,{"$f":"VLOOKUP(G5,List!B:E,4,0)","v":"dcsm-EF_MSA_HV_ON_1_MFB_Safe"},{"$f":"VLOOKUP(G5,List!B:G,6,0)","v":108},{"$error":"#REF!"},"0000    CALL dcsm-EF_MSA_HV_ON_1_MFB_Safe -Run",null,"CALL","dcsm-EF_HEPE_HV_ON_OBS_START",null,null,null,"x"]
[null,null,{"$f":"D5","v":{"$error":"#REF!"}},{"$f":"C6+H6/3600/24","v":{"$error":"#REF!"}},null,null,"MSA_HV_ON_2_MFB_SF",{"$f":"VLOOKUP(G6,List!B:C,2,0)","v":1860},null,null,{"$f":"VLOOKUP(G6,List!B:E,4,0)","v":"dcsm-EF_MSA_HV_ON_2_MFB_Safe"},{"$f":"VLOOKUP(G6,List!B:G,6,0)","v":124},{"$f":"C6-317/3600/24","v":{"$error":"#REF!"}},{"$f":"+\"0000    CALL \"&K6&\" -Run\"","v":"0000    CALL dcsm-EF_MSA_HV_ON_2_MFB_Safe -Run"},null,"CALL","dcsm-EF_HEPE_HV_ON_OBS_START",null,null,null,{"$f":"+IF(Q6=K6,\"\",\"x\")","v":"x"}]
[null,null,{"$error":"#REF!"},{"$error":"#REF!"},null,"TLM mode change (MODE_5)","TLM_MODE_5",{"$f":"VLOOKUP(G7,List!B:C,2,0)","v":42},null,null,{"$f":"VLOOKUP(G7,List!B:E,4,0)","v":"dcsm-EF_BUS_TLM_MODE_5"},{"$f":"VLOOKUP(G7,List!B:G,6,0)","v":2},{"$error":"#REF!"},"0000    CALL dcsm-EF_BUS_TLM_MODE_5 -Run",null,"CALL","dcsm-EF_BUS_TLM_MODE_5",null,null,null,""]
[null,null,{"$error":"#REF!"},{"$f":"C9","v":{"$error":"#REF!"}},"Observation E",null,null,{"$f":"(D8-C8)*3600*24","v":{"$error":"#REF!"}},{"$f":"H8/3600","v":{"$error":"#REF!"}},null,null,0,{"$error":"#REF!"},{"$f":"\"0000    WAIT_SEC  \"&TEXT(H8,\"#0\")","v":{"$error":"#REF!"}},null,"WAIT_SEC",26900,null,null,null,"x"]
[null,null,{"$f":"D9-H9/3600/24","v":{"$error":"#REF!"}},{"$f":"C10","v":{"$error":"#REF!"}},null,"TLM mode change (MODE_10)","TLM_MODE_10",{"$f":"VLOOKUP(G9,List!B:C,2,0)","v":42},null,null,{"$f":"VLOOKUP(G9,List!B:E,4,0)","v":"dcsm-EF_BUS_TLM_MODE_10"},{"$f":"VLOOKUP(G9,List!B:G,6,0)","v":2},{"$error":"#REF!"},{"$f":"+\"0000    CALL \"&K9&\" -Run\"","v":"0000    CALL dcsm-EF_BUS_TLM_MODE_10 -Run"},null,"CALL","dcsm-EF_BUS_TLM_MODE_10",null,null,null,""]
[null,null,{"$f":"D10-H10/3600/24","v":{"$error":"#REF!"}},{"$f":"C11","v":{"$error":"#REF!"}},null,"SI HV OFF","MSA_HV_OFF_VFB",{"$f":"VLOOKUP(G10,List!B:C,2,0)","v":774},null,null,{"$f":"VLOOKUP(G10,List!B:E,4,0)","v":"dcsm-EF_MSA_HV_OFF_VFB"},{"$f":"VLOOKUP(G10,List!B:G,6,0)","v":25},{"$f":"C10-317/3600/24","v":{"$error":"#REF!"}},{"$f":"+\"0000    CALL \"&K10&\" -Run\"","v":"0000    CALL dcsm-EF_MSA_HV_OFF_VFB -Run"},null,"CALL","dcsm-EF_HEPE_HV_OFF_OBS_OFF",null,null,null,{"$f":"+IF(Q10=K10,\"\",\"x\")","v":"x"}]
[null,null,{"$error":"#REF!"},{"$error":"#REF!"},null,null,"MEA1_HV_OFF",{"$f":"VLOOKUP(G11,List!B:C,2,0)","v":182},null,null,{"$f":"VLOOKUP(G11,List!B:E,4,0)","v":"dcsm-EF_MEA1_HV_OFF"},{"$f":"VLOOKUP(G11,List!B:G,6,0)","v":10},{"$error":"#REF!"},"0000    CALL dcsm-EF_MEA1_HV_OFF -Run",null,"CALL","dcsm-EF_HEPE_HV_OFF_OBS_OFF",null,null,null,"x"]
[null,null,{"$f":"D12-H12/3600/24","v":{"$error":"#REF!"}},{"$error":"#REF!"},null,null,"MIA_HV_OFF",{"$f":"VLOOKUP(G12,List!B:C,2,0)","v":60},null,null,{"$f":"VLOOKUP(G12,List!B:E,4,0)","v":"dcsm-EF_MIA_HV_OFF"},{"$f":"VLOOKUP(G12,List!B:G,6,0)","v":1},{"$error":"#REF!"},"0000    CALL dcsm-EF_MIA_HV_OFF -Run",null,"CALL","dcsm-EF_HEPE_HV_OFF_OBS_OFF",null,null,null,"x"]
[null,null,{"$f":"D13-H13/3600/24","v":{"$error":"#REF!"}},{"$error":"#REF!"},null,null,"HEP_HV_OFF",{"$f":"VLOOKUP(G13,List!B:C,2,0)","v":190},null,null,{"$f":"VLOOKUP(G13,List!B:E,4,0)","v":"dcsm-EF_HEPE_HV_OFF_OBS_OFF"},{"$f":"VLOOKUP(G13,List!B:G,6,0)","v":5},{"$error":"#REF!"},"0000    CALL dcsm-EF_HEPE_HV_OFF_OBS_OFF -Run",null,"CALL","dcsm-EF_MEA1_HV_OFF",null,null,null,"x"]
[null,null,{"$f":"#REF!","v":{"$error":"#REF!"}},{"$f":"C14+H14/3600/24","v":{"$error":"#REF!"}},"WOL",null,{"$f":"(#REF!-D13)*24*3600","v":{"$error":"#REF!"}},1200,null,null,{"$f":"VLOOKUP(G14,#REF!,4,0)","v":{"$error":"#REF!"}},0,{"$error":"#REF!"},{"$f":"\"0000    WAIT_SEC  \"&TEXT(G14,\"#0\")","v":{"$error":"#REF!"}},null,"WAIT_SEC",1800,null,null,null,{"$error":"#REF!"}]

{"sheet":"COMMENT","index":7,"n_rows":24,"n_cols":2,"rows_kept":24,"cut":false,"hidden":false,"merged":[]}
["activity","Comment"]
["main_start","#!HEAD: main2-CROUSE_OBS6_XDOR_001_M63 2021-07-01 01:18:36 478        45 MMO                  MAIN2               // OBS-sequence               \n0001  . # LET                  @ONERR=NEXT                   \n0002  . # ==========================================================================\n0003    #  <startTime>2022-03-11T10:45:00Z</startTime>\n0004    #  <stopTime>2022-03-15T06:00:00Z</stopTime>\n0005    #  << XDOR:XDOR_BJXR_C%%%_CRCO_M&&&&&&_00001.BC >> 連続送信*****\n0006    #  << XOR:XOR__BJXR_C%%%_CRCO_M&&&&&&_00001.BC >> *****\n0007    # ==========================================================================\n0008    # ==========================================================================\n0009  . #  EXEC_AT 2022-03-11 10:45:00\n0010    # ◆◇◆◇◆◇◆◇◆◇◆◇◆◇◆◇◆◇◆◇◆◇◆◇◆◇◆◇◆◇◆◇◆◇◆◇◆\n"]
["main_end","\n0291    #############################################################################"]
["OBS","0068    # ==========================================================================\n0069    # @@. Observation \\\\\n0070    # ==========================================================================\n0071    #"]
["WOL","0217    # ==========================================================================\n0218    # @@. WOL # $$\n0219    # ==========================================================================\n0220    #"]
["BUS_ON","0016    # ==========================================================================\n0017    # @@. BUS ON \n0018    # ==========================================================================\n0019    #"]
["MDP ON","0020    # ==========================================================================\n0021    # @@. MDP ON\n0022    # ==========================================================================\n0023    #"]
["SI Check"]
["MDP OFF","0274    # ==========================================================================\n0275    # @@. MDP OFF\n0276    # ==========================================================================\n0277    #"]
["BUS OFF","0285    # ==========================================================================\n0286    # @@. BUS MONI OFF\n0287    # ==========================================================================\n0288    #"]
["SI Power ON","0034    # ==========================================================================\n0035    # @@.  PI POWER ON\n0036    # ==========================================================================\n0037    #"]
["SI HV ON","0049    # ==========================================================================\n0050    # @@.  PI HV ON\n0051    # ==========================================================================\n0052    #"]
["TLM mode change (MODE_5)","0059    # ==========================================================================\n0060    # @@. TLM MODE 5  (Mission: 7kbps, without user HK)\n0061    # ==========================================================================\n0062    #"]
["TLM mode change (MODE_10)","0028    # ==========================================================================\n0029    # @@. TLM MODE 10 (Mission: 4kbps, with user HK)\n0030    # ==========================================================================\n0031    #"]
["SI HV OFF","0207    # ==========================================================================\n0208    # @@. PI HV OFF\n0209    # ==========================================================================\n0210    #"]
{"$rows_left_out":10}
{"sheet":"List","index":8,"n_rows":105,"n_cols":7,"rows_kept":105,"cut":false,"hidden":false,"merged":[[87,0,89,0],[91,0,93,0],[95,0,96,0],[99,0,104,0],[44,0,47,0],[48,0,59,0],[60,0,61,0],[62,0,71,0],[72,0,84,0],[85,0,86,0],[42,0,43,0],[1,0,9,0],[10,0,27,0],[28,0,32,0],[33,0,37,0],[38,0,41,0]]}
[null,null,"Duration (sec)","source filename","filename ",null,"cmdcount"]
["BUS","BUS_CEL_MONI_OFF",40,null,"dcsm-BUS_CEL_MONI_OFF",null,1]
[null,"BUS_CEL_MONI_ON",40,null,"dcsm-BUS_CEL_MONI_ON",null,1]
[null,"BUS_CHG_BEFORE_CHK",0,null,"dcsm-BUS_CHG_BEFORE_CHK",null,0]
[null,"BUS_CHG_EMERGENCY_OFF",86,null,"dcsm-BUS_CHG_Emergency_OFF",null,5]
[null,"BUS_CHG_SET",298,null,"dcsm-BUS_CHG_SET",null,14]
[null,"BUS_CHG_START",82,null,"dcsm-BUS_CHG_START",null,2]
[null,"BUS_CHG_STOP_BAT-EXT",160,null,"dcsm-BUS_CHG_STOP_BAT-EXT",null,4]
[null,"BUS_MMO_OFF",140,null,"dcsm-BUS_MMO_OFF",null,1]
[null,"BUS_MMO_ON",80,null,"dcsm-BUS_MMO_ON",null,2]
["CRCO","CRCO_BUS_MONI_ON",310,null,"dcsm-CRCO_BUS_MONI_ON",null,10]
[null,"CRCO_CEL_MONI_OFF",40,null,"dcsm-CRCO_CEL_MONI_OFF",null,1]
[null,"CRCO_ENA",1134,null,"dcsm-CRCO_ENA_CHECK",null,18]
[null,"CRCO_HEPE",2206,null,"dcsm-CRCO_HEPE_CHECK",null,36]
[null,"CRCO_HEPI",2730,null,"dcsm-CRCO_HEPI_CHECK",null,48]
{"$rows_left_out":91}
{"sheet":"WOL","index":9,"n_rows":7,"n_cols":5,"rows_kept":7,"cut":false,"hidden":false,"merged":[]}
[null,null,"START　TIME","2022-03-11T10:45:00"]
[null,null,"END　TIME","2022-03-15T06:00:00"]
[null,"ID",null,"date time excel","duration(s)"]
[null,"WOLS","WOL#1","2022-03-11T22:19:16",1200]
[null,"WOLS","WOL#2","2022-03-12T21:14:50",1200]
[null,"WOLS","WOL#3","2022-03-13T20:57:06",1200]
[null,"WOLS","WOL#4","2022-03-14T21:05:18",1200]

{"sheet":"obs_sequence","index":10,"n_rows":82,"n_cols":14,"rows_kept":82,"cut":false,"hidden":false,"merged":[[49,5,53,5],[57,5,60,5],[62,5,66,5],[70,5,73,5],[74,5,79,5],[23,5,27,5],[31,5,34,5],[36,5,40,5],[44,5,47,5],[3,0,3,1],[3,2,3,3],[5,5,9,5],[10,5,14,5],[18,5,21,5]]}
["START",null,{"$f":"WOL!D1","v":"2022-03-11T10:45:00"},"OBCP START",{"$f":"C1-12*60*60/3600/24","v":"2022-03-10T22:45:00"},null,null,null,null,null,null,"5days"]
["END",null,{"$f":"WOL!D2","v":"2022-03-15T06:00:00"},"OBCP END",{"$f":"C2+(240+120+300)/3600/24","v":"2022-03-15T06:11:00"},"CMD END",{"$f":"C2-100/3600/24","v":"2022-03-15T05:58:20"}]
[]
["Relative time (h)",null,"Absolute time (UTC)",null,null,null,null,null,null,null,"main2-CROUSE_OBS12_2_XOR_001_M63.cps",{"$f":"+SUM(L6:L83)","v":{"$error":"#N/A"}}]
["Start","End","Start","End","Event","Activity","Procedure","Duration (sec)",null,null,null,"cmd count","XOR Time","cmd count"]
[null,null,"2022-03-11T10:45:00",{"$f":"C6+H6/3600/24","v":"2022-03-11T10:49:52"},null,"SI Power ON","MEA1_ON_SETUP_SW",{"$f":"VLOOKUP(G6,List!B:C,2,0)","v":292},null,null,{"$f":"VLOOKUP(G6,List!B:E,4,0)","v":"dcsm-EF_MEA1_ON_SW"},{"$f":"VLOOKUP(G6,List!B:G,6,0)","v":12},{"$f":"C6-317/3600/24","v":"2022-03-11T10:39:43"},{"$f":"+\"0000    CALL \"&K6&\" -Run\"","v":"0000    CALL dcsm-EF_MEA1_ON_SW -Run"}]
[null,null,{"$f":"D6","v":"2022-03-11T10:49:52"},{"$f":"C7+H7/3600/24","v":"2022-03-11T11:10:22"},null,null,"HEP_ON_SETUP",{"$f":"VLOOKUP(G7,List!B:C,2,0)","v":1230},null,null,{"$f":"VLOOKUP(G7,List!B:E,4,0)","v":"dcsm-EF_HEP_ON_START_for_TL"},{"$f":"VLOOKUP(G7,List!B:G,6,0)","v":34},"2022-03-11T10:44:35","0000    CALL dcsm-EF_HEP_ON_START_for_TL -Run"]
[null,null,{"$f":"D7","v":"2022-03-11T11:10:22"},{"$f":"C8+H8/3600/24","v":"2022-03-11T11:11:42"},null,null,"PME_ON",{"$f":"VLOOKUP(G8,List!B:C,2,0)","v":80},null,null,{"$f":"VLOOKUP(G8,List!B:E,4,0)","v":"dcsm-EF_PME_ON"},{"$f":"VLOOKUP(G8,List!B:G,6,0)","v":2},"2022-03-11T11:05:05","0000    CALL dcsm-EF_PME_ON -Run"]
[null,null,"2022-03-11T11:11:42","2022-03-11T11:11:56",null,null,"MGF_ON_SETUP",{"$f":"VLOOKUP(G9,List!B:C,2,0)","v":14},null,null,{"$f":"VLOOKUP(G9,List!B:E,4,0)","v":"dcsm-EF_MGF_ON"},{"$f":"VLOOKUP(G9,List!B:G,6,0)","v":3},"2022-03-11T11:06:25","0000    CALL dcsm-EF_MGF_ON -Run"]
[null,null,"2022-03-11T11:11:56","2022-03-11T11:18:18",null,null,"MIA_ON_SETUP",{"$f":"VLOOKUP(G10,List!B:C,2,0)","v":382},null,null,{"$f":"VLOOKUP(G10,List!B:E,4,0)","v":"dcsm-EF_MIA_ON"},{"$f":"VLOOKUP(G10,List!B:G,6,0)","v":6},"2022-03-11T11:06:39","0000    CALL dcsm-EF_MIA_ON -Run"]
[null,null,{"$f":"D10","v":"2022-03-11T11:18:18"},"2022-03-11T11:22:48",null,"SI HV ON","HEP_HV_ON",{"$f":"VLOOKUP(G11,List!B:C,2,0)","v":270},null,null,{"$f":"VLOOKUP(G11,List!B:E,4,0)","v":"dcsm-EF_HEPE_HV_ON_OBS_START"},{"$f":"VLOOKUP(G11,List!B:G,6,0)","v":6},"2022-03-11T11:13:01",{"$f":"+\"0000    CALL \"&K11&\" -Run\"","v":"0000    CALL dcsm-EF_HEPE_HV_ON_OBS_START -Run"}]
[null,null,{"$f":"D11","v":"2022-03-11T11:22:48"},"2022-03-11T11:27:10",null,null,"MIA_HV_ON_SW_RC",{"$f":"VLOOKUP(G12,List!B:C,2,0)","v":262},null,null,{"$f":"VLOOKUP(G12,List!B:E,4,0)","v":"dcsm-EF_MIA_HV_ON_SW_RC"},{"$f":"VLOOKUP(G12,List!B:G,6,0)","v":7},"2022-03-11T11:17:31",{"$f":"+\"0000    CALL \"&K12&\" -Run\"","v":"0000    CALL dcsm-EF_MIA_HV_ON_SW_RC -Run"}]
[null,null,"2022-03-11T11:27:10","2022-03-11T11:55:32",null,null,"MEA1_HV_ON",{"$f":"VLOOKUP(G13,List!B:C,2,0)","v":1702},null,null,{"$f":"VLOOKUP(G13,List!B:E,4,0)","v":"dcsm-EF_MEA1_HV_ON"},{"$f":"VLOOKUP(G13,List!B:G,6,0)","v":27},"2022-03-11T11:21:53","0000    CALL dcsm-EF_MEA1_HV_ON -Run"]
[null,null,"2022-03-11T11:55:32","2022-03-11T12:21:45",null,null,"MSA_HV_ON_1_MFB_SF",{"$f":"VLOOKUP(G14,List!B:C,2,0)","v":1573},null,null,{"$f":"VLOOKUP(G14,List!B:E,4,0)","v":"dcsm-EF_MSA_HV_ON_1_MFB_Safe"},{"$f":"VLOOKUP(G14,List!B:G,6,0)","v":108},"2022-03-11T11:50:15","0000    CALL dcsm-EF_MSA_HV_ON_1_MFB_Safe -Run"]
[null,null,"2022-03-11T12:21:45","2022-03-11T12:52:45",null,null,"MSA_HV_ON_2_MFB_SF",{"$f":"VLOOKUP(G15,List!B:C,2,0)","v":1860},null,null,{"$f":"VLOOKUP(G15,List!B:E,4,0)","v":"dcsm-EF_MSA_HV_ON_2_MFB_Safe"},{"$f":"VLOOKUP(G15,List!B:G,6,0)","v":124},"2022-03-11T12:16:28","0000    CALL dcsm-EF_MSA_HV_ON_2_MFB_Safe -Run"]
{"$rows_left_out":67}