{"text_format":"1","workbook":"xlsx","n_sheets":11,"sheets":["確認事項","変更履歴","実行","チェック表","START","END","LOOP","COMMENT","List","WOL","obs_sequence"],"not_rendered":{"charts":0,"images":0,"macros":1,"external_links":0,"defined_names":5,"comments":0,"pivot_tables":0},"unopened":[],"bounds":{"document_bytes":16777216,"sheet_cells":100000,"rows_first":2000,"rows_last":500,"rows_between":2000,"halvings":0,"cell_chars":16384,"cell_head_chars":4096},"cells_cut":0,"cells_raw":0,"read":"whole","date_system":"1900"}

{"sheet":"確認事項","index":0,"n_rows":1,"n_cols":4,"rows_kept":1,"cut":false,"hidden":false,"merged":[]}
["NO.","確認事項","回答","CLOSE"]

{"sheet":"変更履歴","index":1,"n_rows":9,"n_cols":4,"rows_kept":9,"cut":false,"hidden":false,"merged":[[0,0,0,3]]}
["MMO観測計画作成ツール　変更履歴"]
["日付","Ver","変更者","変更内容"]
["2021-08-06",1,"山下","-"]
["2021-08-09",2,"arare","コマンド出力のmain　end部分を出力するように修正した\nListにMSA_HV_ON_VFB1、MSA_HV_ON_VFB2追加\nObs_sequence XOR Time行追記\nコマンドの開始終了時間をOBS時間に変更"]
["2021-08-17",3,"arare","WOLの時間をG列から取得するように変更"]
["2021-08-25",4,"arare","COMMENTにmainstart,endのXDOR,XOR用追記"]
["2021-09-27",5,"arare","＃refの対応 obserbation Aから昇順につける"]
["2021-10-19",6,"arare","ListにMSAHV追記"]
["2021-10-21",7,"arare","Listを最新にした"]

{"sheet":"実行","index":2,"n_rows":16,"n_cols":6,"rows_kept":16,"cut":false,"hidden":false,"merged":[]}
[]
[]
[]
[]
[]
[]
[]
[null,null,null,null,null,"【操作】"]
["C番号",987,null,null,null,"「実行」シートの「観測作成」を押下。"]
["M番号",631202,null,null,null,"→「START」、「LOOP」、「END」を「obs_sequence」に貼り付けます。"]
[null,null,null,null,null,"「実行」シートの「時刻反映」を押下。"]
[null,null,null,null,null,"→WOLの時間と関数エラーとなっているセルを修正します。"]
[null,null,null,null,null,"【注意点】"]
[null,null,null,null,null,"「START」、「LOOP」、「END」の\"cmd count\"からシート内に何行あるかを取得しているので、ここは空白がないように\"0”を入力してください。"]
[null,null,null,null,null,"もし空白があった場合、コピー範囲が小さくなってしまいます。"]
[null,null,null,null,null,"”WOL”シートの4行目以下は、実施するWOLのみを記載すること。\n(4行目以下に、期間開始日時と終了日時の記載は不要です。)"]

{"sheet":"チェック表","index":3,"n_rows":19,"n_cols":4,"rows_kept":19,"cut":false,"hidden":true,"merged":[]}
[]
[null,"コマンド作成時注意項目"]
[null,"NO.","項目","チェック"]
[null,1,"\n観測期間開始時に「dcsm-EF_BUS_MONI_ON」手順が入っていることを確認する。\nただし、前回の観測終了時に「dcsm-EF_BUS_MONI_OFF」を実行していない場合は確認不要。\n","□"]
[null,2,"\n観測期間開始日に、観測する機器の”ON”手順が入っていることを確認する。\nただし、PWI、MGF、MAST、WPTを\"ON\"にする場合は、PWI、MGF、MAST、WPTよりも先にPMEが\"ON\"となっていること。\n※クルーズ観測中は、MEA1,HEPE,MGFのみ”ON”\n","□"]
[null,3,"\nTLM MODEが観測前に「５」　観測終了後は「１０」　となっていることを確認する\n","□"]
[null,4,"\n観測時間が”86400”を超えるていないか確認する。\n超えていた場合は、main計画作成時に途中ダミーコマンドを挿入すること\n"]
[null,5,"WOLの開始時刻が正しいことを確認する","□"]
[null,6,"\nWOLの時間を確認　HV　OFFになっていることを確認する\n↓\nクルーズ観測を行っている機器(HEPE、ENA、MIA、MEA、MSAのみ)\nフライバイを行っている機器(MSA,PWI,MGF,MEA,ENA,MIA,HEPE,MDM)\n","□"]
[null,7,"\nWOL終了時刻＋10以降にのHVがONになっていることを確認する。\nクルーズ観測を行っている機器(HEPE、ENA、MIA、MEA、MSAのみ)\nフライバイを行っている機器(MSA,PWI,MGF,MEA,ENA,MIA,HEPE,MDM)\n","□"]
[null,8,"\n観測期間最終日に、観測を行った機器の”OFF”手順が入っていることを確認する。\nただし、PWI,MGF,MAST,WPT-OFF手順の後にPME-OFF手順が入っていることを確認する。\n","□"]
[null,9,"\nMDP_POWEROFFのあとにdcsm-MC_ENA_MDPが入っていることを確認する。\n","□"]
[null,10,"\nCELのMONI ONは長時間(1h以上の場合は、山下さんと要相談)しないこと　\nBUSにはCELのみのもあるので注意　dcsm-BUS_CEL_MONI_ON　dcsm-BUS_CEL_MONI_OFF\n","□"]
[null,11,"MEA1の  SCAN ON は　dcsm-EF_MEA1_ON_SW.cpsに入っているので\n　　　順番は　MDP ONして\n　　　　　　　dcsm-EF_MEA1_ON_SW.cps\n　　　　　　　dcsm-EF_MEA1_HV_ON.cps\n　　　　　　　dcsm-EF_MEA1_HV_OFF.cps\n　　　　　　　dcsm-EF_MEA1_HV_ON.cps\n　　　　　　　dcsm-EF_MEA1_HV_SCAN_OFF.cps\n　　　　　　　dcsm-EF_MEA1_OFF.cps\n　　　　　　　MDP　OFF\n　　　　　　　\n  　　　　　　dcsm-EF_MEA_ON_SW.cps\n　　　　　　　dcsm-EF_MEA_HV_ON.cps\n　　　　　　　dcsm-EF_MEA_HV_OFF.cps\n　　　　　　　dcsm-EF_MEA_HV_ON.cps\n　　　　　　　dcsm-EF_MEA_HV_SCAN_OFF.cps\n　　　　　　　dcsm-EF_MEA_OFF.cps\n\n　　　になる\n　SCAN OFFにすると　データが出てこない　HV OFF->ON時は注意する","□"]
[null,13,"2021/6/25以降　dcsm-EF_MSA_ON_C　が最新　dcsm-EF_MSA_ONは使用しない","□"]
[null,14,"2021/6/25以降　dcsm-CRCO_MIA_CHECK_C　が最新　dcsm-CRCO_MIA_CHECKは使用しない（クルーズチェックアウトの時）","□"]
[null,15,"2021/6/25以降　dcsm-CRCO_MSA_CHECK_C　が最新　dcsm-CRCO_MSA_CHECKは使用しない（クルーズチェックアウトの時）","□"]
[null,16,"フライバイ時、MIAのHV_ON時間帯によって違うので必ず確認する\nMIA_HV_ON_RC\nMIA_HV_ON_SW_RC\nMIA_HV_ON_MAG_RC","□"]
[null,17,"Excelの時間を確認する　時間通りになっているか","□"]

{"sheet":"START","index":4,"n_rows":6,"n_cols":21,"rows_kept":6,"cut":false,"hidden":false,"merged":[[1,5,5,5]]}
["Start","End","Start","End","Event","Activity","Procedure","Duration (sec)",null,null,null,"cmd count",null,"cmd count"]
[null,null,{"$f":"#REF!","v":{"$error":"#REF!"}},{"$f":"C2+H2/3600/24","v":{"$error":"#REF!"}},null,"SI Power ON","MEA1_ON_SETUP_SW",{"$f":"VLOOKUP(G2,List!B:C,2,0)","v":292},null,null,{"$f":"VLOOKUP(G2,List!B:E,4,0)","v":"dcsm-EF_MEA1_ON_SW"},{"$f":"VLOOKUP(G2,List!B:G,6,0)","v":12},{"$f":"C2-317/3600/24","v":{"$error":"#REF!"}},{"$f":"+\"0000    CALL \"&K2&\" -Run\"","v":"0000    CALL dcsm-EF_MEA1_ON_SW -Run"},null,"CALL","dcsm-EF_BUS_MONI_ON",null,null,null,{"$f":"+IF(Q2=K2,\"\",\"x\")","v":"x"}]
[null,null,{"$f":"D2","v":{"$error":"#REF!"}},{"$f":"C3+H3/3600/24","v":{"$error":"#REF!"}},null,null,"HEP_ON_SETUP",{"$f":"VLOOKUP(G3,List!B:C,2,0)","v":1230},null,null,{"$f":"VLOOKUP(G3,List!B:E,4,0)","v":"dcsm-EF_HEP_ON_START_for_TL"},{"$f":"VLOOKUP(G3,List!B:G,6,0)","v":34},{"$error":"#REF!"},"0000    CALL dcsm-EF_HEP_ON_START_for_TL -Run",null,"CALL","dcsm-EF_MDP_ON",null,null,null,{"$f":"+IF(Q3=K3,\"\",\"x\")","v":"x"}]
[null,null,{"$f":"D3","v":{"$error":"#REF!"}},{"$f":"C4+H4/3600/24","v":{"$error":"#REF!"}},null,null,"PME_ON",{"$f":"VLOOKUP(G4,List!B:C,2,0)","v":80},null,null,{"$f":"VLOOKUP(G4,List!B:E,4,0)","v":"dcsm-EF_PME_ON"},{"$f":"VLOOKUP(G4,List!B:G,6,0)","v":2},{"$error":"#REF!"},"0000    CALL dcsm-EF_PME_ON -Run"]
[null,null,{"$error":"#REF!"},{"$error":"#REF!"},null,null,"MGF_ON_SETUP",{"$f":"VLOOKUP(G5,List!B:C,2,0)","v":14},null,null,{"$f":"VLOOKUP(G5,List!B:E,4,0)","v":"dcsm-EF_MGF_ON"},{"$f":"VLOOKUP(G5,List!B:G,6,0)","v":3},{"$error":"#REF!"},"0000    CALL dcsm-EF_MGF_ON -Run"]
[null,null,{"$error":"#REF!"},{"$f":"C6+H6/3600/24","v":{"$error":"#REF!"}},null,null,"MIA_ON_SETUP",{"$f":"VLOOKUP(G6,List!B:C,2,0)","v":382},null,null,{"$f":"VLOOKUP(G6,List!B:E,4,0)","v":"dcsm-EF_MIA_ON"},{"$f":"VLOOKUP(G6,List!B:G,6,0)","v":6},{"$error":"#REF!"},"0000    CALL dcsm-EF_MIA_ON -Run"]

{"sheet":"END","index":5,"n_rows":9,"n_cols":21,"rows_kept":9,"cut":false,"hidden":false,"merged":[[1,5,6,5]]}
["Start","End","Start","End","Event","Activity","Procedure","Duration (sec)",null,null,null,"cmd count",null,"cmd count"]
[null,null,{"$f":"D2-H2/3600/24","v":{"$error":"#REF!"}},{"$f":"C3","v":{"$error":"#REF!"}},null,"SI Power ON","HEP_OFF",{"$f":"VLOOKUP(G2,List!B:C,2,0)","v":70},null,null,{"$f":"VLOOKUP(G2,List!B:E,4,0)","v":"dcsm-EF_HEPE_OFF_STOP"},{"$f":"VLOOKUP(G2,List!B:G,6,0)","v":4},{"$f":"C2-317/3600/24","v":{"$error":"#REF!"}},{"$f":"+\"0000    CALL \"&K2&\" -Run\"","v":"0000    CALL dcsm-EF_HEPE_OFF_STOP -Run"},null,"CALL","dcsm-EF_HEPE_OFF_STOP",null,null,null,{"$f":"+IF(Q2=K2,\"\",\"x\")","v":""}]
[null,null,{"$error":"#REF!"},{"$f":"C4","v":{"$error":"#REF!"}},null,null,"MEA1_OFF",{"$f":"VLOOKUP(G3,List!B:C,2,0)","v":160},null,null,{"$f":"VLOOKUP(G3,List!B:E,4,0)","v":"dcsm-EF_MEA1_OFF"},{"$f":"VLOOKUP(G3,List!B:G,6,0)","v":4},{"$error":"#REF!"},{"$f":"+\"0000    CALL \"&K3&\" -Run\"","v":"0000    CALL dcsm-EF_MEA1_OFF -Run"},null,"CALL","dcsm-EF_MEA1_OFF",null,null,null,""]
[null,null,{"$error":"#REF!"},{"$error":"#REF!"},null,null,"MGF_OFF",{"$f":"VLOOKUP(G4,List!B:C,2,0)","v":8},null,null,{"$f":"VLOOKUP(G4,List!B:E,4,0)","v":"dcsm-EF_MGF_OFF"},{"$f":"VLOOKUP(G4,List!B:G,6,0)","v":1},{"$error":"#REF!"},"0000    CALL dcsm-EF_MGF_OFF -Run",null,"CALL","dcsm-EF_MGF_OFF",null,null,null,""]
[null,null,{"$error":"#REF!"},{"$error":"#REF!"},null,null,"PME_OFF",{"$f":"VLOOKUP(G5,List!B:C,2,0)","v":40},null,null,{"$f":"VLOOKUP(G5,List!B:E,4,0)","v":"dcsm-EF_PME_OFF"},{"$f":"VLOOKUP(G5,List!B:G,6,0)","v":1},{"$error":"#REF!"},"0000    CALL dcsm-EF_PME_OFF -Run",null,"CALL","dcsm-EF_PME_OFF",null,null,null,""]
[null,null,{"$error":"#REF!"},{"$f":"C7","v":{"$error":"#REF!"}},null,null,"MIA_OFF",{"$f":"VLOOKUP(G6,List!B:C,2,0)","v":160},null,null,{"$f":"VLOOKUP(G6,List!B:E,4,0)","v":"dcsm-EF_MIA_OFF"},{"$f":"VLOOKUP(G6,List!B:G,6,0)","v":4},{"$error":"#REF!"},"0000    CALL dcsm-EF_MIA_OFF -Run",null,"CALL","dcsm-EF_MDP_POWEROFF",null,null,null,"x"]
[null,null,{"$f":"D7-H7/3600/24","v":{"$error":"#REF!"}},{"$f":"C8","v":{"$error":"#REF!"}},null,null,"MSA_OFF",{"$f":"VLOOKUP(G7,List!B:C,2,0)","v":380},null,null,{"$f":"VLOOKUP(G7,List!B:E,4,0)","v":"dcsm-EF_MSA_OFF"},{"$f":"VLOOKUP(G7,List!B:G,6,0)","v":25},{"$f":"C7-317/3600/24","v":{"$error":"#REF!"}},"0000    CALL dcsm-EF_MSA_OFF -Run"]
[null,null,{"$error":"#REF!"},{"$f":"C9","v":{"$error":"#REF!"}},null,"MDP OFF","MDP_OFF_D",{"$f":"VLOOKUP(G8,List!B:C,2,0)","v":120},null,null,{"$f":"VLOOKUP(G8,List!B:E,4,0)","v":"dcsm-EF_MDP_POWEROFF"},{"$f":"VLOOKUP(G8,List!B:G,6,0)","v":3},{"$error":"#REF!"},"0000    CALL dcsm-EF_MDP_POWEROFF -Run",null,null,null,null,null,null,{"$f":"+IF(#REF!=K8,\"\",\"x\")","v":{"$error":"#REF!"}}]
[null,null,{"$f":"#REF!","v":{"$error":"#REF!"}},{"$f":"C9+H9/3600/24","v":{"$error":"#REF!"}},{"$f":"#REF!","v":{"$error":"#REF!"}},null,"END",1200,null,null,{"$f":"VLOOKUP(G9,List!B:E,4,0)","v":{"$error":"#N/A"}},{"$f":"VLOOKUP(G9,List!B:G,6,0)","v":{"$error":"#N/A"}},{"$error":"#REF!"}]

{"sheet":"LOOP","index":6,"n_rows":14,"n_cols":21,"rows_kept":14,"cut":false,"hidden":false,"merged":[[9,5,12,5],[1,5,5,5]]}
["Start","End","Start","End","Event","Activity","Procedure","Duration (sec)",null,null,null,"cmd count",null,"cmd count"]
[null,null,{"$f":"#REF!","v":{"$error":"#REF!"}},{"$f":"C2+H2/3600/24","v":{"$error":"#REF!"}},null,"SI HV ON","HEP_HV_ON",{"$f":"VLOOKUP(G2,List!B:C,2,0)","v":270},null,null,{"$f":"VLOOKUP(G2,List!B:E,4,0)","v":"dcsm-EF_HEPE_HV_ON_OBS_START"},{"$f":"VLOOKUP(G2,List!B:G,6,0)","v":6},{"$f":"C2-317/3600/24","v":{"$error":"#REF!"}},{"$f":"+\"0000    CALL \"&K2&\" -Run\"","v":"0000    CALL dcsm-EF_HEPE_HV_ON_OBS_START -Run"},null,"CALL","dcsm-EF_MEA1_HV_ON",null,null,null,{"$f":"+IF(Q2=K2,\"\",\"x\")","v":"x"}]
[null,null,{"$f":"D2","v":{"$error":"#REF!"}},{"$error":"#REF!"},null,null,"MIA_HV_ON_SW_RC",{"$f":"VLOOKUP(G3,List!B:C,2,0)","v":262},null,null,{"$f":"VLOOKUP(G3,List!B:E,4,0)","v":"dcsm-EF_MIA_HV_ON_SW_RC"},{"$f":"VLOOKUP(G3,List!B:G,6,0)","v":7},{"$error":"#REF!"},{"$f":"+\"0000    CALL \"&K3&\" -Run\"","v":"0000    CALL dcsm-EF_MIA_HV_ON_SW_RC -Run"},null,"CALL","dcsm-EF_HEPE_HV_ON_OBS_START",null,null,null,"x"]
[null,null,{"$f":"D3","v":{"$error":"#REF!"}},{"$f":"C4+H4/3600/24","v":{"$error":"#REF!"}},null,null,"MEA1_HV_ON",{"$f":"VLOOKUP(G4,List!B:C,2,0)","v":1702},null,null,{"$f":"VLOOKUP(G4,List!B:E,4,0)","v":"dcsm-EF_MEA1_HV_ON"},{"$f":"VLOOKUP(G4,List!B:G,6,0)","v":27},{"$f":"C4-317/3600/24","v":{"$error":"#REF!"}},{"$f":"+\"0000    CALL \"&K4&\" -Run\"","v":"0000    CALL dcsm-EF_MEA1_HV_ON -Run"},null,"CALL","dcsm-EF_HEPE_HV_ON_OBS_START",null,null,null,{"$f":"+IF(Q4=K4,\"\",\"x\")","v":"x"}]
[null,null,{"$error":"#REF!"},{"$error":"#REF!"},null,null,"MSA_HV_ON_1_MFB_SF",{"$f":"VLOOKUP(G5,List!B:C,2,0)","v":1573},null,null,{"$f":"VLOOKUP(G5,List!B:E,4,0)","v":"dcsm-EF_MSA_HV_ON_1_MFB_Safe"},{"$f":"VLOOKUP(G5,List!B:G,6,0)","v":108},{"$error":"#REF!"},"0000    CALL dcsm-EF_MSA_HV_ON_1_MFB_Safe -Run",null,"CALL","dcsm-EF_HEPE_HV_ON_OBS_START",null,null,null,"x"]
[null,null,{"$f":"D5","v":{"$error":"#REF!"}},{"$f":"C6+H6/3600/24","v":{"$error":"#REF!"}},null,null,"MSA_HV_ON_2_MFB_SF",{"$f":"VLOOKUP(G6,List!B:C,2,0)","v":1860},null,null,{"$f":"VLOOKUP(G6,List!B:E,4,0)","v":"dcsm-EF_MSA_HV_ON_2_MFB_Safe"},{"$f":"VLOOKUP(G6,List!B:G,6,0)","v":124},{"$f":"C6-317/3600/24","v":{"$error":"#REF!"}},{"$f":"+\"0000    CALL \"&K6&\" -Run\"","v":"0000    CALL dcsm-EF_MSA_HV_ON_2_MFB_Safe -Run"},null,"CALL","dcsm-EF_HEPE_HV_ON_OBS_START",null,null,null,{"$f":"+IF(Q6=K6,\"\",\"x\")","v":"x"}]
[null,null,{"$error":"#REF!"},{"$error":"#REF!"},null,"TLM mode change (MODE_5)","TLM_MODE_5",{"$f":"VLOOKUP(G7,List!B:C,2,0)","v":42},null,null,{"$f":"VLOOKUP(G7,List!B:E,4,0)","v":"dcsm-EF_BUS_TLM_MODE_5"},{"$f":"VLOOKUP(G7,List!B:G,6,0)","v":2},{"$error":"#REF!"},"0000    CALL dcsm-EF_BUS_TLM_MODE_5 -Run",null,"CALL","dcsm-EF_BUS_TLM_MODE_5",null,null,null,""]
[null,null,{"$error":"#REF!"},{"$f":"C9","v":{"$error":"#REF!"}},"Observation E",null,null,{"$f":"(D8-C8)*3600*24","v":{"$error":"#REF!"}},{"$f":"H8/3600","v":{"$error":"#REF!"}},null,null,0,{"$error":"#REF!"},{"$f":"\"0000    WAIT_SEC  \"&TEXT(H8,\"#0\")","v":{"$error":"#REF!"}},null,"WAIT_SEC",26900,null,null,null,"x"]
[null,null,{"$f":"D9-H9/3600/24","v":{"$error":"#REF!"}},{"$f":"C10","v":{"$error":"#REF!"}},null,"TLM mode change (MODE_10)","TLM_MODE_10",{"$f":"VLOOKUP(G9,List!B:C,2,0)","v":42},null,null,{"$f":"VLOOKUP(G9,List!B:E,4,0)","v":"dcsm-EF_BUS_TLM_MODE_10"},{"$f":"VLOOKUP(G9,List!B:G,6,0)","v":2},{"$error":"#REF!"},{"$f":"+\"0000    CALL \"&K9&\" -Run\"","v":"0000    CALL dcsm-EF_BUS_TLM_MODE_10 -Run"},null,"CALL","dcsm-EF_BUS_TLM_MODE_10",null,null,null,""]
[null,null,{"$f":"D10-H10/3600/24","v":{"$error":"#REF!"}},{"$f":"C11","v":{"$error":"#REF!"}},null,"SI HV OFF","MSA_HV_OFF_VFB",{"$f":"VLOOKUP(G10,List!B:C,2,0)","v":774},null,null,{"$f":"VLOOKUP(G10,List!B:E,4,0)","v":"dcsm-EF_MSA_HV_OFF_VFB"},{"$f":"VLOOKUP(G10,List!B:G,6,0)","v":25},{"$f":"C10-317/3600/24","v":{"$error":"#REF!"}},{"$f":"+\"0000    CALL \"&K10&\" -Run\"","v":"0000    CALL dcsm-EF_MSA_HV_OFF_VFB -Run"},null,"CALL","dcsm-EF_HEPE_HV_OFF_OBS_OFF",null,null,null,{"$f":"+IF(Q10=K10,\"\",\"x\")","v":"x"}]
[null,null,{"$error":"#REF!"},{"$error":"#REF!"},null,null,"MEA1_HV_OFF",{"$f":"VLOOKUP(G11,List!B:C,2,0)","v":182},null,null,{"$f":"VLOOKUP(G11,List!B:E,4,0)","v":"dcsm-EF_MEA1_HV_OFF"},{"$f":"VLOOKUP(G11,List!B:G,6,0)","v":10},{"$error":"#REF!"},"0000    CALL dcsm-EF_MEA1_HV_OFF -Run",null,"CALL","dcsm-EF_HEPE_HV_OFF_OBS_OFF",null,null,null,"x"]
[null,null,{"$f":"D12-H12/3600/24","v":{"$error":"#REF!"}},{"$error":"#REF!"},null,null,"MIA_HV_OFF",{"$f":"VLOOKUP(G12,List!B:C,2,0)","v":60},null,null,{"$f":"VLOOKUP(G12,List!B:E,4,0)","v":"dcsm-EF_MIA_HV_OFF"},{"$f":"VLOOKUP(G12,List!B:G,6,0)","v":1},{"$error":"#REF!"},"0000    CALL dcsm-EF_MIA_HV_OFF -Run",null,"CALL","dcsm-EF_HEPE_HV_OFF_OBS_OFF",null,null,null,"x"]
[null,null,{"$f":"D13-H13/3600/24","v":{"$error":"#REF!"}},{"$error":"#REF!"},null,null,"HEP_HV_OFF",{"$f":"VLOOKUP(G13,List!B:C,2,0)","v":190},null,null,{"$f":"VLOOKUP(G13,List!B:E,4,0)","v":"dcsm-EF_HEPE_HV_OFF_OBS_OFF"},{"$f":"VLOOKUP(G13,List!B:G,6,0)","v":5},{"$error":"#REF!"},"0000    CALL dcsm-EF_HEPE_HV_OFF_OBS_OFF -Run",null,"CALL","dcsm-EF_MEA1_HV_OFF",null,null,null,"x"]
[null,null,{"$f":"#REF!","v":{"$error":"#REF!"}},{"$f":"C14+H14/3600/24","v":{"$error":"#REF!"}},"WOL",null,{"$f":"(#REF!-D13)*24*3600","v":{"$error":"#REF!"}},1200,null,null,{"$f":"VLOOKUP(G14,#REF!,4,0)","v":{"$error":"#REF!"}},0,{"$error":"#REF!"},{"$f":"\"0000    WAIT_SEC  \"&TEXT(G14,\"#0\")","v":{"$error":"#REF!"}},null,"WAIT_SEC",1800,null,null,null,{"$error":"#REF!"}]

{"sheet":"COMMENT","index":7,"n_rows":24,"n_cols":2,"rows_kept":24,"cut":false,"hidden":false,"merged":[]}
["activity","Comment"]
["main_start","#!HEAD: main2-CROUSE_OBS6_XDOR_001_M63 2021-07-01 01:18:36 478        45 MMO                  MAIN2               // OBS-sequence               \n0001  . # LET                  @ONERR=NEXT                   \n0002  . # ==========================================================================\n0003    #  <startTime>2022-03-11T10:45:00Z</startTime>\n0004    #  <stopTime>2022-03-15T06:00:00Z</stopTime>\n0005    #  << XDOR:XDOR_BJXR_C%%%_CRCO_M&&&&&&_00001.BC >> 連続送信*****\n0006    #  << XOR:XOR__BJXR_C%%%_CRCO_M&&&&&&_00001.BC >> *****\n0007    # ==========================================================================\n0008    # ==========================================================================\n0009  . #  EXEC_AT 2022-03-11 10:45:00\n0010    # ◆◇◆◇◆◇◆◇◆◇◆◇◆◇◆◇◆◇◆◇◆◇◆◇◆◇◆◇◆◇◆◇◆◇◆◇◆\n"]
["main_end","\n0291    #############################################################################"]
["OBS","0068    # ==========================================================================\n0069    # @@. Observation \\\\\n0070    # ==========================================================================\n0071    #"]
["WOL","0217    # ==========================================================================\n0218    # @@. WOL # $$\n0219    # ==========================================================================\n0220    #"]
["BUS_ON","0016    # ==========================================================================\n0017    # @@. BUS ON \n0018    # ==========================================================================\n0019    #"]
["MDP ON","0020    # ==========================================================================\n0021    # @@. MDP ON\n0022    # ==========================================================================\n0023    #"]
["SI Check"]
["MDP OFF","0274    # ==========================================================================\n0275    # @@. MDP OFF\n0276    # ==========================================================================\n0277    #"]
["BUS OFF","0285    # ==========================================================================\n0286    # @@. BUS MONI OFF\n0287    # ==========================================================================\n0288    #"]
["SI Power ON","0034    # ==========================================================================\n0035    # @@.  PI POWER ON\n0036    # ==========================================================================\n0037    #"]
["SI HV ON","0049    # ==========================================================================\n0050    # @@.  PI HV ON\n0051    # ==========================================================================\n0052    #"]
["TLM mode change (MODE_5)","0059    # ==========================================================================\n0060    # @@. TLM MODE 5  (Mission: 7kbps, without user HK)\n0061    # ==========================================================================\n0062    #"]
["TLM mode change (MODE_10)","0028    # ==========================================================================\n0029    # @@. TLM MODE 10 (Mission: 4kbps, with user HK)\n0030    # ==========================================================================\n0031    #"]
["SI HV OFF","0207    # ==========================================================================\n0208    # @@. PI HV OFF\n0209    # ==========================================================================\n0210    #"]
["SI Power OFF","0259    # ==========================================================================\n0260    # @@. PI Power OFF\n0261    # ==========================================================================\n0262    #"]
["MSA SOFT RESET"]
["MACRO COMMAND ENA","0280    # ==========================================================================\n0281    # @@. MACRO ENA \n0282    # ==========================================================================\n0283    #"]
["CrouseCheckOut"]
[]
["main_start(XDOR)","#!HEAD: main2-CROUSE_OBS6_XDOR_001_M63 2021-07-01 01:18:36 478        45 MMO                  MAIN2               // Earth Fly-by                \n0001  . # LET                  @ONERR=NEXT                   \n0002  . # ==========================================================================\n0003    #  <startTime>2021-07-06T08:00:00Z</startTime>\n0004    #  <stopTime>2021-07-15T10:00:00Z</stopTime>\n0005    #  << XDOR:XDOR_BJXR_C%%%_CRCO_M&&&&&&_00001.BC >> 連続送信*****\n0006    #  << XOR:XOR__BJXR_C%%%_CRCO_M&&&&&&_00001.BC >> *****\n0007    # ==========================================================================\n0008    # ==========================================================================\n0009  . #  EXEC_AT 2021-07-06 08:00:00\n0010    # ◆◇◆◇◆◇◆◇◆◇◆◇◆◇◆◇◆◇◆◇◆◇◆◇◆◇◆◇◆◇◆◇◆◇◆◇◆\n0015    # ==========================================================================\n0016    # 0. MMO MOSIF Heater &  Switch to Standby Mode\n0017    # ==========================================================================\n0018    #\n0019    # Change MOSIF Heater Setting   (14sec)\n0020    # <forMPO>AJXF017A</forMPO>     \n0021    WAIT_SEC             42586                \n0022    #\n0023    # MMO Switch to Standby Mode (main) (300sec)\n0024    # <forMPO>AJXF001A</forMPO> \n0025    WAIT_SEC             60                   \n0026    #\n0027    # MMO Set HK rate to 64 second  (3sec)\n0028    # <forMPO>AJXF005A</forMPO> \n0029    WAIT_SEC              237                  \n0030    #"]
["main_start(XOR)","#!HEAD: main2-CROUSE_OBS6_XDOR_001_M63 2021-07-01 01:18:36 478        45 MMO                  MAIN2               // Earth Fly-by                \n0001  . # LET                  @ONERR=NEXT                   \n0002  . # ==========================================================================\n0003    #  <startTime>2021-07-06T08:00:00Z</startTime>\n0004    #  <stopTime>2021-07-15T10:00:00Z</stopTime>\n0005    #  << XDOR:XDOR_BJXR_C%%%_CRCO_M&&&&&&_00001.BC >> 連続送信*****\n0006    #  << XOR:XOR__BJXR_C%%%_CRCO_M&&&&&&_00001.BC >> *****\n0007    # ==========================================================================\n0008    # ==========================================================================\n0009  . #  EXEC_AT 2021-07-06 08:00:00\n0010    # ◆◇◆◇◆◇◆◇◆◇◆◇◆◇◆◇◆◇◆◇◆◇◆◇◆◇◆◇◆◇◆◇◆◇◆◇◆\n0015    # ==========================================================================\n0016    # 0. MMO MOSIF Heater &  Switch to Standby Mode\n0017    # ==========================================================================\n0018    #\n0019    # Change MOSIF Heater Setting   (14sec)\n0020    # <forMPO>AJXF017A</forMPO>     \n0021    WAIT_SEC             42600             \n0022    #\n0023    # MMO Switch to Standby Mode (main) (300sec)\n0024    # <forMPO>AJXF001A</forMPO> \n0025    WAIT_SEC             360                   \n0026    #\n0027    # MMO Set HK rate to 64 second  (3sec)\n0028    # <forMPO>AJXF005A</forMPO> \n0029    WAIT_SEC              240                  \n0030    #"]
["main_end(XDOR)","0122    # ==========================================================================\n0123    # 99. MMO Dormant Mode\n0124    # ==========================================================================\n0125    WAIT_SEC             240                   \n0126    #\n0127    # MMO Set HK rate to 1 second   (3sec)\n0128    # <forMPO>AJXF004A</forMPO>\n0129    WAIT_SEC             117                 \n0130    #\n0131    # MMO Switch to Dormant Mode  (70sec)\n0132    # <forMPO>AJXF002A</forMPO>\n0133    WAIT_SEC             230                   \n0134    #\n0135    # Return MOSIF heater setting   (14sec)\n0136    # <forMPO>AJXF017B</forMPO>                   \n0291    #############################################################################"]
["main_end(XOR)","0122    # ==========================================================================\n0123    # 99. MMO Dormant Mode\n0124    # ==========================================================================\n0125    WAIT_SEC             240                   \n0126    #\n0127    # MMO Set HK rate to 1 second   (3sec)\n0128    # <forMPO>AJXF004A</forMPO>\n0129    WAIT_SEC             120                 \n0130    #\n0131    # MMO Switch to Dormant Mode  (70sec)\n0132    # <forMPO>AJXF002A</forMPO>\n0133    WAIT_SEC             300                   \n0134    #\n0135    # Return MOSIF heater setting   (14sec)\n0136    # <forMPO>AJXF017B</forMPO>                   \n0291    #############################################################################"]

{"sheet":"List","index":8,"n_rows":105,"n_cols":7,"rows_kept":105,"cut":false,"hidden":false,"merged":[[87,0,89,0],[91,0,93,0],[95,0,96,0],[99,0,104,0],[44,0,47,0],[48,0,59,0],[60,0,61,0],[62,0,71,0],[72,0,84,0],[85,0,86,0],[42,0,43,0],[1,0,9,0],[10,0,27,0],[28,0,32,0],[33,0,37,0],[38,0,41,0]]}
[null,null,"Duration (sec)","source filename","filename ",null,"cmdcount"]
["BUS","BUS_CEL_MONI_OFF",40,null,"dcsm-BUS_CEL_MONI_OFF",null,1]
[null,"BUS_CEL_MONI_ON",40,null,"dcsm-BUS_CEL_MONI_ON",null,1]
[null,"BUS_CHG_BEFORE_CHK",0,null,"dcsm-BUS_CHG_BEFORE_CHK",null,0]
[null,"BUS_CHG_EMERGENCY_OFF",86,null,"dcsm-BUS_CHG_Emergency_OFF",null,5]
[null,"BUS_CHG_SET",298,null,"dcsm-BUS_CHG_SET",null,14]
[null,"BUS_CHG_START",82,null,"dcsm-BUS_CHG_START",null,2]
[null,"BUS_CHG_STOP_BAT-EXT",160,null,"dcsm-BUS_CHG_STOP_BAT-EXT",null,4]
[null,"BUS_MMO_OFF",140,null,"dcsm-BUS_MMO_OFF",null,1]
[null,"BUS_MMO_ON",80,null,"dcsm-BUS_MMO_ON",null,2]
["CRCO","CRCO_BUS_MONI_ON",310,null,"dcsm-CRCO_BUS_MONI_ON",null,10]
[null,"CRCO_CEL_MONI_OFF",40,null,"dcsm-CRCO_CEL_MONI_OFF",null,1]
[null,"CRCO_ENA",1134,null,"dcsm-CRCO_ENA_CHECK",null,18]
[null,"CRCO_HEPE",2206,null,"dcsm-CRCO_HEPE_CHECK",null,36]
[null,"CRCO_HEPI",2730,null,"dcsm-CRCO_HEPI_CHECK",null,48]
[null,"CRCO_MASTWPT",1848,null,"dcsm-CRCO_MASTWPT_CHECK",null,41]
[null,"CRCO_MDM",2332,null,"dcsm-CRCO_MDM_CHECK",null,45]
[null,"CRCO_MDP_OFF",120,null,"dcsm-CRCO_MDP_OFF",null,4]
[null,"CRCO_MDP_ON",509,null,"dcsm-CRCO_MDP_ON",null,12]
[null,"CRCO_MEA",4620,null,"dcsm-CRCO_MEA_CHECK",null,52]
[null,"CRCO_MGF",3969,null,"dcsm-CRCO_MGF_CHECK",null,49]
[null,"CRCO_MIA_C",1892,null,"dcsm-CRCO_MIA_CHECK_C",null,20]
[null,"CRCO_MSASI",6688,null,"dcsm-CRCO_MSASI_CHECK",null,23]
[null,"CRCO_MSA_C",1102,null,"dcsm-CRCO_MSA_CHECK_C",null,19]
[null,"CRCO_PME_OFF",120,null,"dcsm-CRCO_PME_OFF",null,5]
[null,"CRCO_PME_ON",160,null,"dcsm-CRCO_PME_ON",null,5]
[null,"CRCO_PWI",2448,null,"dcsm-CRCO_PWI_CHECK",null,51]
[null,"CRCO_SI_READY",377,null,"dcsm-CRCO_SI_READY",null,17]
["BUS","BUS_OFF_D",220,null,"dcsm-EF_BUS_MONI_OFF",null,5]
[null,"BUS_SETUP_D",577,null,"dcsm-EF_BUS_MONI_ON",null,20]
[null,"TLM_MODE_10",42,null,"dcsm-EF_BUS_TLM_MODE_10",null,2]
[null,"TLM_MODE_5",42,null,"dcsm-EF_BUS_TLM_MODE_5",null,2]
[null,"TLM_MODE_7",2,null,"dcsm-EF_BUS_TLM_MODE_7",null,1]
["ENA","ENA_HV_OFF",198,null,"dcsm-EF_ENA_HV_OFF",null,4]
[null,"ENA_HV_ON",344,null,"dcsm-EF_ENA_HV_ON",null,18]
[null,"ENA_HV_ON_H",344,null,"dcsm-EF_ENA_HV_ON_H",null,18]
[null,"ENA_OFF",88,null,"dcsm-EF_ENA_power_OFF",null,4]
[null,"ENA_ON_SETUP",564,null,"dcsm-EF_ENA_power_ON",null,7]
["HEP","HEP_HV_OFF",190,null,"dcsm-EF_HEPE_HV_OFF_OBS_OFF",null,5]
[null,"HEP_HV_ON",270,null,"dcsm-EF_HEPE_HV_ON_OBS_START",null,6]
[null,"HEP_OFF",70,null,"dcsm-EF_HEPE_OFF_STOP",null,4]
[null,"HEP_ON_SETUP",1230,null,"dcsm-EF_HEP_ON_START_for_TL",null,34]
["MDM","MDM_OFF",160,null,"dcsm-EF_MDM_OFF",null,4]
[null,"MDM_ON_SETUP",202,null,"dcsm-EF_MDM_ON",null,6]
["MDP","MDP_CRUISE_SET",42,null,"dcsm-EF_MDP_CRUISE_SET",null,2]
[null,"MDP_ERR_DUMP",9080,null,"dcsm-EF_MDP_ERR_DUMP",null,6]
[null,"MDP_ON_D",509,null,"dcsm-EF_MDP_ON",null,11]
[null,"MDP_OFF_D",120,null,"dcsm-EF_MDP_POWEROFF",null,3]
["MEA","MEA1_HV_OFF",182,null,"dcsm-EF_MEA1_HV_OFF",null,10]
[null,"MEA1_HV_ON",1702,null,"dcsm-EF_MEA1_HV_ON",null,27]
[null,"MEA1_HV_SCAN_OFF",186,null,"dcsm-EF_MEA1_HV_SCAN_OFF",null,12]
[null,"MEA1_OFF",160,null,"dcsm-EF_MEA1_OFF",null,4]
[null,"MEA1_ON_SETUP_SW",292,null,"dcsm-EF_MEA1_ON_SW",null,12]
[null,"MEA_HV_OFF",202,null,"dcsm-EF_MEA_HV_OFF",null,20]
[null,"MEA_HV_ON",1756,null,"dcsm-EF_MEA_HV_ON",null,54]
[null,"MEA_HV_ON_MOD",126,null,"dcsm-EF_MEA_HV_ON_modified",null,6]
[null,"MEA_HV_SCAN_OFF",210,null,"dcsm-EF_MEA_HV_SCAN_OFF",null,24]
[null,"MEA_OFF",164,null,"dcsm-EF_MEA_OFF",null,6]
[null,"MEA_ON_SETUP_MAG",386,null,"dcsm-EF_MEA_ON_MAG",null,21]
[null,"MEA_ON_SETUP_SW",386,null,"dcsm-EF_MEA_ON_SW",null,21]
["MGF","MGF_OFF",8,null,"dcsm-EF_MGF_OFF",null,1]
[null,"MGF_ON_SETUP",14,null,"dcsm-EF_MGF_ON",null,3]
["MIA","MIA_HV_OFF",60,null,"dcsm-EF_MIA_HV_OFF",null,1]
[null,"MIA_HV_ON",240,null,"dcsm-EF_MIA_HV_ON",null,6]
[null,"MIA_HV_ON_MAG",142,null,"dcsm-EF_MIA_HV_ON_MAG",null,4]
[null,"MIA_HV_ON_MAG_RC",262,null,"dcsm-EF_MIA_HV_ON_MAG_RC",null,7]
[null,"MIA_HV_ON_RC",280,null,"dcsm-EF_MIA_HV_ON_RC",null,7]
[null,"MIA_HV_ON_SW",102,null,"dcsm-EF_MIA_HV_ON_SW",null,3]
[null,"MIA_HV_ON_SW_RC",262,null,"dcsm-EF_MIA_HV_ON_SW_RC",null,7]
[null,"MIA_OFF",160,null,"dcsm-EF_MIA_OFF",null,4]
[null,"MIA_ON_SETUP",382,null,"dcsm-EF_MIA_ON",null,6]
[null,"MIA_ON_C",0,null,"dcsm-EF_MIA_ON_C",null,0]
["MSA","MSA_HV_OFF",714,null,"dcsm-EF_MSA_HV_OFF",null,24]
[null,"MSA_HV_OFF_VFB",774,null,"dcsm-EF_MSA_HV_OFF_VFB",null,25]
[null,"MSA_HV_ON_1",4692,null,"dcsm-EF_MSA_HV_ON_1",null,108]
[null,"MSA_HV_ON_1_MFB_SF",1573,null,"dcsm-EF_MSA_HV_ON_1_MFB_Safe",null,108]
[null,"MSA_HV_ON_VFB1",2882,null,"dcsm-EF_MSA_HV_ON_1_VFB",null,108]
[null,"MSA_HV_ON_2",6262,null,"dcsm-EF_MSA_HV_ON_2",null,124]
[null,"MSA_HV_ON_2_MFB_SF",1860,null,"dcsm-EF_MSA_HV_ON_2_MFB_Safe",null,124]
[null,"MSA_HV_ON_VFB2",3262,null,"dcsm-EF_MSA_HV_ON_2_VFB",null,124]
[null,"MSA_OFF",380,null,"dcsm-EF_MSA_OFF",null,25]
[null,"MSA_ON_SETUP",1092,null,"dcsm-EF_MSA_ON",null,15]
[null,"MSA_ON_SETUP_C",1092,null,"dcsm-EF_MSA_ON_C",null,15]
[null,"MSA_SOFT_RESET",120,null,"dcsm-EF_MSA_SOFT_RESET",null,3]
[null,"MSA_SOFT_RESET2",100,null,"dcsm-EF_MSA_SOFT_RESET2",null,5]
["PME","PME_OFF",40,null,"dcsm-EF_PME_OFF",null,1]
[null,"PME_ON",80,null,"dcsm-EF_PME_ON",null,2]
["PWI","PWI_OFF",80,null,"dcsm-EF_PWI_OFF",null,2]
[null,"PWI_ON",828,null,"dcsm-EF_PWI_ON",null,26]
[null,"PWI_ON_SETUP",868,null,"dcsm-EF_PWI_ON_CRUISE",null,27]
["MACRO","MC_ENA",246,null,"dcsm-MC_ENA_MDP",null,21]
["MDP","MDP_AP9_DUMP",1880,null,"dcsm-MDP_AP09_LOG_DUMP",null,4]
[null,"MDP_ERR_LOG_DUMP",9080,null,"dcsm-MDP_ERR_LOG_DUMP",null,6]
[null,"MDP_HK_REPEINT_6",42,null,"dcsm-MDP_HK_REPINT_6",null,2]
["MEA","MEA2_MEM_DMP",2550,null,"dcsm-MEA2_MEM_DMP",null,36]
["MSASI","MSASI_DARK_1",768,null,"dcsm-MSASI_dark_CO_sequence1",null,11]
[null,"MSASI_DARK_2",19498,null,"dcsm-MSASI_dark_CO_sequence2",null,55]
["MSA","MSA_TABLE_UPLOAD",0,null,"dcsm-MSA_TABLE_UPLOAD",null,0]
["TCFS","TCSF_MSASI",345,null,"dcsm-tcfs_tbl1_msasi_set",null,13]
["WAIT","WAIT3600",3600]
[null,"WAIT3500",3500]
[null,"WAIT19357",19357]
[null,"WAIT1800",1800,null,"WAIT_SEC 1800"]
[null,"WAIT10800",10800,null,"WAIT_SEC 10800"]
[null,"WAIT600",600,null,"WAIT_SEC 600"]

{"sheet":"WOL","index":9,"n_rows":7,"n_cols":5,"rows_kept":7,"cut":false,"hidden":false,"merged":[]}
[null,null,"START　TIME","2022-03-11T10:45:00"]
[null,null,"END　TIME","2022-03-15T06:00:00"]
[null,"ID",null,"date time excel","duration(s)"]
[null,"WOLS","WOL#1","2022-03-11T22:19:16",1200]
[null,"WOLS","WOL#2","2022-03-12T21:14:50",1200]
[null,"WOLS","WOL#3","2022-03-13T20:57:06",1200]
[null,"WOLS","WOL#4","2022-03-14T21:05:18",1200]

{"sheet":"obs_sequence","index":10,"n_rows":82,"n_cols":14,"rows_kept":82,"cut":false,"hidden":false,"merged":[[49,5,53,5],[57,5,60,5],[62,5,66,5],[70,5,73,5],[74,5,79,5],[23,5,27,5],[31,5,34,5],[36,5,40,5],[44,5,47,5],[3,0,3,1],[3,2,3,3],[5,5,9,5],[10,5,14,5],[18,5,21,5]]}
["START",null,{"$f":"WOL!D1","v":"2022-03-11T10:45:00"},"OBCP START",{"$f":"C1-12*60*60/3600/24","v":"2022-03-10T22:45:00"},null,null,null,null,null,null,"5days"]
["END",null,{"$f":"WOL!D2","v":"2022-03-15T06:00:00"},"OBCP END",{"$f":"C2+(240+120+300)/3600/24","v":"2022-03-15T06:11:00"},"CMD END",{"$f":"C2-100/3600/24","v":"2022-03-15T05:58:20"}]
[]
["Relative time (h)",null,"Absolute time (UTC)",null,null,null,null,null,null,null,"main2-CROUSE_OBS12_2_XOR_001_M63.cps",{"$f":"+SUM(L6:L83)","v":{"$error":"#N/A"}}]
["Start","End","Start","End","Event","Activity","Procedure","Duration (sec)",null,null,null,"cmd count","XOR Time","cmd count"]
[null,null,"2022-03-11T10:45:00",{"$f":"C6+H6/3600/24","v":"2022-03-11T10:49:52"},null,"SI Power ON","MEA1_ON_SETUP_SW",{"$f":"VLOOKUP(G6,List!B:C,2,0)","v":292},null,null,{"$f":"VLOOKUP(G6,List!B:E,4,0)","v":"dcsm-EF_MEA1_ON_SW"},{"$f":"VLOOKUP(G6,List!B:G,6,0)","v":12},{"$f":"C6-317/3600/24","v":"2022-03-11T10:39:43"},{"$f":"+\"0000    CALL \"&K6&\" -Run\"","v":"0000    CALL dcsm-EF_MEA1_ON_SW -Run"}]
[null,null,{"$f":"D6","v":"2022-03-11T10:49:52"},{"$f":"C7+H7/3600/24","v":"2022-03-11T11:10:22"},null,null,"HEP_ON_SETUP",{"$f":"VLOOKUP(G7,List!B:C,2,0)","v":1230},null,null,{"$f":"VLOOKUP(G7,List!B:E,4,0)","v":"dcsm-EF_HEP_ON_START_for_TL"},{"$f":"VLOOKUP(G7,List!B:G,6,0)","v":34},"2022-03-11T10:44:35","0000    CALL dcsm-EF_HEP_ON_START_for_TL -Run"]
[null,null,{"$f":"D7","v":"2022-03-11T11:10:22"},{"$f":"C8+H8/3600/24","v":"2022-03-11T11:11:42"},null,null,"PME_ON",{"$f":"VLOOKUP(G8,List!B:C,2,0)","v":80},null,null,{"$f":"VLOOKUP(G8,List!B:E,4,0)","v":"dcsm-EF_PME_ON"},{"$f":"VLOOKUP(G8,List!B:G,6,0)","v":2},"2022-03-11T11:05:05","0000    CALL dcsm-EF_PME_ON -Run"]
[null,null,"2022-03-11T11:11:42","2022-03-11T11:11:56",null,null,"MGF_ON_SETUP",{"$f":"VLOOKUP(G9,List!B:C,2,0)","v":14},null,null,{"$f":"VLOOKUP(G9,List!B:E,4,0)","v":"dcsm-EF_MGF_ON"},{"$f":"VLOOKUP(G9,List!B:G,6,0)","v":3},"2022-03-11T11:06:25","0000    CALL dcsm-EF_MGF_ON -Run"]
[null,null,"2022-03-11T11:11:56","2022-03-11T11:18:18",null,null,"MIA_ON_SETUP",{"$f":"VLOOKUP(G10,List!B:C,2,0)","v":382},null,null,{"$f":"VLOOKUP(G10,List!B:E,4,0)","v":"dcsm-EF_MIA_ON"},{"$f":"VLOOKUP(G10,List!B:G,6,0)","v":6},"2022-03-11T11:06:39","0000    CALL dcsm-EF_MIA_ON -Run"]
[null,null,{"$f":"D10","v":"2022-03-11T11:18:18"},"2022-03-11T11:22:48",null,"SI HV ON","HEP_HV_ON",{"$f":"VLOOKUP(G11,List!B:C,2,0)","v":270},null,null,{"$f":"VLOOKUP(G11,List!B:E,4,0)","v":"dcsm-EF_HEPE_HV_ON_OBS_START"},{"$f":"VLOOKUP(G11,List!B:G,6,0)","v":6},"2022-03-11T11:13:01",{"$f":"+\"0000    CALL \"&K11&\" -Run\"","v":"0000    CALL dcsm-EF_HEPE_HV_ON_OBS_START -Run"}]
[null,null,{"$f":"D11","v":"2022-03-11T11:22:48"},"2022-03-11T11:27:10",null,null,"MIA_HV_ON_SW_RC",{"$f":"VLOOKUP(G12,List!B:C,2,0)","v":262},null,null,{"$f":"VLOOKUP(G12,List!B:E,4,0)","v":"dcsm-EF_MIA_HV_ON_SW_RC"},{"$f":"VLOOKUP(G12,List!B:G,6,0)","v":7},"2022-03-11T11:17:31",{"$f":"+\"0000    CALL \"&K12&\" -Run\"","v":"0000    CALL dcsm-EF_MIA_HV_ON_SW_RC -Run"}]
[null,null,"2022-03-11T11:27:10","2022-03-11T11:55:32",null,null,"MEA1_HV_ON",{"$f":"VLOOKUP(G13,List!B:C,2,0)","v":1702},null,null,{"$f":"VLOOKUP(G13,List!B:E,4,0)","v":"dcsm-EF_MEA1_HV_ON"},{"$f":"VLOOKUP(G13,List!B:G,6,0)","v":27},"2022-03-11T11:21:53","0000    CALL dcsm-EF_MEA1_HV_ON -Run"]
[null,null,"2022-03-11T11:55:32","2022-03-11T12:21:45",null,null,"MSA_HV_ON_1_MFB_SF",{"$f":"VLOOKUP(G14,List!B:C,2,0)","v":1573},null,null,{"$f":"VLOOKUP(G14,List!B:E,4,0)","v":"dcsm-EF_MSA_HV_ON_1_MFB_Safe"},{"$f":"VLOOKUP(G14,List!B:G,6,0)","v":108},"2022-03-11T11:50:15","0000    CALL dcsm-EF_MSA_HV_ON_1_MFB_Safe -Run"]
[null,null,"2022-03-11T12:21:45","2022-03-11T12:52:45",null,null,"MSA_HV_ON_2_MFB_SF",{"$f":"VLOOKUP(G15,List!B:C,2,0)","v":1860},null,null,{"$f":"VLOOKUP(G15,List!B:E,4,0)","v":"dcsm-EF_MSA_HV_ON_2_MFB_Safe"},{"$f":"VLOOKUP(G15,List!B:G,6,0)","v":124},"2022-03-11T12:16:28","0000    CALL dcsm-EF_MSA_HV_ON_2_MFB_Safe -Run"]
[null,null,"2022-03-11T12:52:45","2022-03-11T12:53:27",null,"TLM mode change (MODE_5)","TLM_MODE_5",{"$f":"VLOOKUP(G16,List!B:C,2,0)","v":42},null,null,{"$f":"VLOOKUP(G16,List!B:E,4,0)","v":"dcsm-EF_BUS_TLM_MODE_5"},{"$f":"VLOOKUP(G16,List!B:G,6,0)","v":2},"2022-03-11T12:47:28","0000    CALL dcsm-EF_BUS_TLM_MODE_5 -Run"]
[null,null,"2022-03-11T12:53:27",{"$f":"C18","v":"2022-03-11T21:58:28"},"Observation A",null,null,{"$f":"(D17-C17)*3600*24","v":32701.000000583008},{"$f":"H17/3600","v":9.0836111112730578},null,null,0,"2022-03-11T12:48:10",{"$f":"\"0000    WAIT_SEC  \"&TEXT(H17,\"#0\")","v":"0000    WAIT_SEC  32701"}]
[null,null,{"$f":"D18-H18/3600/24","v":"2022-03-11T21:58:28"},{"$f":"C19","v":"2022-03-11T21:59:10"},null,"TLM mode change (MODE_10)","TLM_MODE_10",{"$f":"VLOOKUP(G18,List!B:C,2,0)","v":42},null,null,{"$f":"VLOOKUP(G18,List!B:E,4,0)","v":"dcsm-EF_BUS_TLM_MODE_10"},{"$f":"VLOOKUP(G18,List!B:G,6,0)","v":2},"2022-03-11T21:53:11",{"$f":"+\"0000    CALL \"&K18&\" -Run\"","v":"0000    CALL dcsm-EF_BUS_TLM_MODE_10 -Run"}]
[null,null,{"$f":"D19-H19/3600/24","v":"2022-03-11T21:59:10"},{"$f":"C20","v":"2022-03-11T22:12:04"},null,"SI HV OFF","MSA_HV_OFF_VFB",{"$f":"VLOOKUP(G19,List!B:C,2,0)","v":774},null,null,{"$f":"VLOOKUP(G19,List!B:E,4,0)","v":"dcsm-EF_MSA_HV_OFF_VFB"},{"$f":"VLOOKUP(G19,List!B:G,6,0)","v":25},"2022-03-11T21:53:53","0000    CALL dcsm-EF_MSA_HV_OFF_VFB -Run"]
[null,null,"2022-03-11T22:12:04","2022-03-11T22:15:06",null,null,"MEA1_HV_OFF",{"$f":"VLOOKUP(G20,List!B:C,2,0)","v":182},null,null,{"$f":"VLOOKUP(G20,List!B:E,4,0)","v":"dcsm-EF_MEA1_HV_OFF"},{"$f":"VLOOKUP(G20,List!B:G,6,0)","v":10},"2022-03-11T22:06:47","0000    CALL dcsm-EF_MEA1_HV_OFF -Run"]
[null,null,{"$f":"D21-H21/3600/24","v":"2022-03-11T22:15:06"},"2022-03-11T22:16:06",null,null,"MIA_HV_OFF",{"$f":"VLOOKUP(G21,List!B:C,2,0)","v":60},null,null,{"$f":"VLOOKUP(G21,List!B:E,4,0)","v":"dcsm-EF_MIA_HV_OFF"},{"$f":"VLOOKUP(G21,List!B:G,6,0)","v":1},"2022-03-11T22:09:49","0000    CALL dcsm-EF_MIA_HV_OFF -Run"]
[null,null,{"$f":"D22-H22/3600/24","v":"2022-03-11T22:16:06"},"2022-03-11T22:19:16",null,null,"HEP_HV_OFF",{"$f":"VLOOKUP(G22,List!B:C,2,0)","v":190},null,null,{"$f":"VLOOKUP(G22,List!B:E,4,0)","v":"dcsm-EF_HEPE_HV_OFF_OBS_OFF"},{"$f":"VLOOKUP(G22,List!B:G,6,0)","v":5},"2022-03-11T22:10:49","0000    CALL dcsm-EF_HEPE_HV_OFF_OBS_OFF -Run"]
[null,null,"2022-03-11T22:19:16",{"$f":"C23+H23/3600/24","v":"2022-03-11T22:39:16"},"WOL#1",null,{"$f":"(C24-D22)*24*3600","v":1800.0000002095476},1200,null,null,null,0,"2022-03-11T22:13:59",{"$f":"\"0000    WAIT_SEC  \"&TEXT(G23,\"#0\")","v":"0000    WAIT_SEC  1800"}]
[null,null,{"$f":"D23+10/60/24","v":"2022-03-11T22:49:16"},{"$f":"C24+H24/3600/24","v":"2022-03-11T22:53:46"},null,"SI HV ON","HEP_HV_ON",{"$f":"VLOOKUP(G24,List!B:C,2,0)","v":270},null,null,{"$f":"VLOOKUP(G24,List!B:E,4,0)","v":"dcsm-EF_HEPE_HV_ON_OBS_START"},{"$f":"VLOOKUP(G24,List!B:G,6,0)","v":6},"2022-03-11T22:43:59",{"$f":"+\"0000    CALL \"&K24&\" -Run\"","v":"0000    CALL dcsm-EF_HEPE_HV_ON_OBS_START -Run"}]
[null,null,{"$f":"D24","v":"2022-03-11T22:53:46"},"2022-03-11T22:58:08",null,null,"MIA_HV_ON_SW_RC",{"$f":"VLOOKUP(G25,List!B:C,2,0)","v":262},null,null,{"$f":"VLOOKUP(G25,List!B:E,4,0)","v":"dcsm-EF_MIA_HV_ON_SW_RC"},{"$f":"VLOOKUP(G25,List!B:G,6,0)","v":7},"2022-03-11T22:48:29",{"$f":"+\"0000    CALL \"&K25&\" -Run\"","v":"0000    CALL dcsm-EF_MIA_HV_ON_SW_RC -Run"}]
[null,null,"2022-03-11T22:58:08","2022-03-11T23:26:30",null,null,"MEA1_HV_ON",{"$f":"VLOOKUP(G26,List!B:C,2,0)","v":1702},null,null,{"$f":"VLOOKUP(G26,List!B:E,4,0)","v":"dcsm-EF_MEA1_HV_ON"},{"$f":"VLOOKUP(G26,List!B:G,6,0)","v":27},"2022-03-11T22:52:51","0000    CALL dcsm-EF_MEA1_HV_ON -Run"]
[null,null,"2022-03-11T23:26:30","2022-03-11T23:52:43",null,null,"MSA_HV_ON_1_MFB_SF",{"$f":"VLOOKUP(G27,List!B:C,2,0)","v":1573},null,null,{"$f":"VLOOKUP(G27,List!B:E,4,0)","v":"dcsm-EF_MSA_HV_ON_1_MFB_Safe"},{"$f":"VLOOKUP(G27,List!B:G,6,0)","v":108},"2022-03-11T23:21:13","0000    CALL dcsm-EF_MSA_HV_ON_1_MFB_Safe -Run"]
[null,null,"2022-03-11T23:52:43","2022-03-12T00:23:43",null,null,"MSA_HV_ON_2_MFB_SF",{"$f":"VLOOKUP(G28,List!B:C,2,0)","v":1860},null,null,{"$f":"VLOOKUP(G28,List!B:E,4,0)","v":"dcsm-EF_MSA_HV_ON_2_MFB_Safe"},{"$f":"VLOOKUP(G28,List!B:G,6,0)","v":124},"2022-03-11T23:47:26","0000    CALL dcsm-EF_MSA_HV_ON_2_MFB_Safe -Run"]
[null,null,"2022-03-12T00:23:43","2022-03-12T00:24:25",null,"TLM mode change (MODE_5)","TLM_MODE_5",{"$f":"VLOOKUP(G29,List!B:C,2,0)","v":42},null,null,{"$f":"VLOOKUP(G29,List!B:E,4,0)","v":"dcsm-EF_BUS_TLM_MODE_5"},{"$f":"VLOOKUP(G29,List!B:G,6,0)","v":2},"2022-03-12T00:18:26","0000    CALL dcsm-EF_BUS_TLM_MODE_5 -Run"]
[null,null,"2022-03-12T00:24:25",{"$f":"C31","v":"2022-03-12T20:54:02"},"Observation B",null,null,{"$f":"(D30-C30)*3600*24","v":73777.000000700355},{"$f":"H30/3600","v":20.493611111305654},null,null,0,"2022-03-12T00:19:08",{"$f":"\"0000    WAIT_SEC  \"&TEXT(H30,\"#0\")","v":"0000    WAIT_SEC  73777"}]
[null,null,{"$f":"D31-H31/3600/24","v":"2022-03-12T20:54:02"},{"$f":"C32","v":"2022-03-12T20:54:44"},null,"TLM mode change (MODE_10)","TLM_MODE_10",{"$f":"VLOOKUP(G31,List!B:C,2,0)","v":42},null,null,{"$f":"VLOOKUP(G31,List!B:E,4,0)","v":"dcsm-EF_BUS_TLM_MODE_10"},{"$f":"VLOOKUP(G31,List!B:G,6,0)","v":2},"2022-03-12T20:48:45",{"$f":"+\"0000    CALL \"&K31&\" -Run\"","v":"0000    CALL dcsm-EF_BUS_TLM_MODE_10 -Run"}]
[null,null,{"$f":"D32-H32/3600/24","v":"2022-03-12T20:54:44"},{"$f":"C33","v":"2022-03-12T21:07:38"},null,"SI HV OFF","MSA_HV_OFF_VFB",{"$f":"VLOOKUP(G32,List!B:C,2,0)","v":774},null,null,{"$f":"VLOOKUP(G32,List!B:E,4,0)","v":"dcsm-EF_MSA_HV_OFF_VFB"},{"$f":"VLOOKUP(G32,List!B:G,6,0)","v":25},"2022-03-12T20:49:27","0000    CALL dcsm-EF_MSA_HV_OFF_VFB -Run"]
[null,null,"2022-03-12T21:07:38","2022-03-12T21:10:40",null,null,"MEA1_HV_OFF",{"$f":"VLOOKUP(G33,List!B:C,2,0)","v":182},null,null,{"$f":"VLOOKUP(G33,List!B:E,4,0)","v":"dcsm-EF_MEA1_HV_OFF"},{"$f":"VLOOKUP(G33,List!B:G,6,0)","v":10},"2022-03-12T21:02:21","0000    CALL dcsm-EF_MEA1_HV_OFF -Run"]
[null,null,{"$f":"D34-H34/3600/24","v":"2022-03-12T21:10:40"},"2022-03-12T21:11:40",null,null,"MIA_HV_OFF",{"$f":"VLOOKUP(G34,List!B:C,2,0)","v":60},null,null,{"$f":"VLOOKUP(G34,List!B:E,4,0)","v":"dcsm-EF_MIA_HV_OFF"},{"$f":"VLOOKUP(G34,List!B:G,6,0)","v":1},"2022-03-12T21:05:23","0000    CALL dcsm-EF_MIA_HV_OFF -Run"]
[null,null,{"$f":"D35-H35/3600/24","v":"2022-03-12T21:11:40"},"2022-03-12T21:14:50",null,null,"HEP_HV_OFF",{"$f":"VLOOKUP(G35,List!B:C,2,0)","v":190},null,null,{"$f":"VLOOKUP(G35,List!B:E,4,0)","v":"dcsm-EF_HEPE_HV_OFF_OBS_OFF"},{"$f":"VLOOKUP(G35,List!B:G,6,0)","v":5},"2022-03-12T21:06:23","0000    CALL dcsm-EF_HEPE_HV_OFF_OBS_OFF -Run"]
[null,null,"2022-03-12T21:14:50",{"$f":"C36+H36/3600/24","v":"2022-03-12T21:34:50"},"WOL#2",null,{"$f":"(C37-D35)*24*3600","v":1800.0000002095476},1200,null,null,null,0,"2022-03-12T21:09:33",{"$f":"\"0000    WAIT_SEC  \"&TEXT(G36,\"#0\")","v":"0000    WAIT_SEC  1800"}]
[null,null,{"$f":"D36+10/60/24","v":"2022-03-12T21:44:50"},{"$f":"C37+H37/3600/24","v":"2022-03-12T21:49:20"},null,"SI HV ON","HEP_HV_ON",{"$f":"VLOOKUP(G37,List!B:C,2,0)","v":270},null,null,{"$f":"VLOOKUP(G37,List!B:E,4,0)","v":"dcsm-EF_HEPE_HV_ON_OBS_START"},{"$f":"VLOOKUP(G37,List!B:G,6,0)","v":6},"2022-03-12T21:39:33",{"$f":"+\"0000    CALL \"&K37&\" -Run\"","v":"0000    CALL dcsm-EF_HEPE_HV_ON_OBS_START -Run"}]
[null,null,{"$f":"D37","v":"2022-03-12T21:49:20"},"2022-03-12T21:53:42",null,null,"MIA_HV_ON_SW_RC",{"$f":"VLOOKUP(G38,List!B:C,2,0)","v":262},null,null,{"$f":"VLOOKUP(G38,List!B:E,4,0)","v":"dcsm-EF_MIA_HV_ON_SW_RC"},{"$f":"VLOOKUP(G38,List!B:G,6,0)","v":7},"2022-03-12T21:44:03",{"$f":"+\"0000    CALL \"&K38&\" -Run\"","v":"0000    CALL dcsm-EF_MIA_HV_ON_SW_RC -Run"}]
[null,null,"2022-03-12T21:53:42","2022-03-12T22:22:04",null,null,"MEA1_HV_ON",{"$f":"VLOOKUP(G39,List!B:C,2,0)","v":1702},null,null,{"$f":"VLOOKUP(G39,List!B:E,4,0)","v":"dcsm-EF_MEA1_HV_ON"},{"$f":"VLOOKUP(G39,List!B:G,6,0)","v":27},"2022-03-12T21:48:25","0000    CALL dcsm-EF_MEA1_HV_ON -Run"]
[null,null,"2022-03-12T22:22:04","2022-03-12T22:48:17",null,null,"MSA_HV_ON_1_MFB_SF",{"$f":"VLOOKUP(G40,List!B:C,2,0)","v":1573},null,null,{"$f":"VLOOKUP(G40,List!B:E,4,0)","v":"dcsm-EF_MSA_HV_ON_1_MFB_Safe"},{"$f":"VLOOKUP(G40,List!B:G,6,0)","v":108},"2022-03-12T22:16:47","0000    CALL dcsm-EF_MSA_HV_ON_1_MFB_Safe -Run"]
[null,null,"2022-03-12T22:48:17","2022-03-12T23:19:17",null,null,"MSA_HV_ON_2_MFB_SF",{"$f":"VLOOKUP(G41,List!B:C,2,0)","v":1860},null,null,{"$f":"VLOOKUP(G41,List!B:E,4,0)","v":"dcsm-EF_MSA_HV_ON_2_MFB_Safe"},{"$f":"VLOOKUP(G41,List!B:G,6,0)","v":124},"2022-03-12T22:43:00","0000    CALL dcsm-EF_MSA_HV_ON_2_MFB_Safe -Run"]
[null,null,"2022-03-12T23:19:17","2022-03-12T23:19:59",null,"TLM mode change (MODE_5)","TLM_MODE_5",{"$f":"VLOOKUP(G42,List!B:C,2,0)","v":42},null,null,{"$f":"VLOOKUP(G42,List!B:E,4,0)","v":"dcsm-EF_BUS_TLM_MODE_5"},{"$f":"VLOOKUP(G42,List!B:G,6,0)","v":2},"2022-03-12T23:14:00","0000    CALL dcsm-EF_BUS_TLM_MODE_5 -Run"]
[null,null,"2022-03-12T23:19:59",{"$f":"C44","v":"2022-03-13T20:36:18"},"Observation C",null,null,{"$f":"(D43-C43)*3600*24","v":76579.000000655651},{"$f":"H43/3600","v":21.27194444462657},null,null,0,"2022-03-12T23:14:42",{"$f":"\"0000    WAIT_SEC  \"&TEXT(H43,\"#0\")","v":"0000    WAIT_SEC  76579"}]
[null,null,{"$f":"D44-H44/3600/24","v":"2022-03-13T20:36:18"},{"$f":"C45","v":"2022-03-13T20:37:00"},null,"TLM mode change (MODE_10)","TLM_MODE_10",{"$f":"VLOOKUP(G44,List!B:C,2,0)","v":42},null,null,{"$f":"VLOOKUP(G44,List!B:E,4,0)","v":"dcsm-EF_BUS_TLM_MODE_10"},{"$f":"VLOOKUP(G44,List!B:G,6,0)","v":2},"2022-03-13T20:31:01",{"$f":"+\"0000    CALL \"&K44&\" -Run\"","v":"0000    CALL dcsm-EF_BUS_TLM_MODE_10 -Run"}]
[null,null,{"$f":"D45-H45/3600/24","v":"2022-03-13T20:37:00"},{"$f":"C46","v":"2022-03-13T20:49:54"},null,"SI HV OFF","MSA_HV_OFF_VFB",{"$f":"VLOOKUP(G45,List!B:C,2,0)","v":774},null,null,{"$f":"VLOOKUP(G45,List!B:E,4,0)","v":"dcsm-EF_MSA_HV_OFF_VFB"},{"$f":"VLOOKUP(G45,List!B:G,6,0)","v":25},"2022-03-13T20:31:43","0000    CALL dcsm-EF_MSA_HV_OFF_VFB -Run"]
[null,null,"2022-03-13T20:49:54","2022-03-13T20:52:56",null,null,"MEA1_HV_OFF",{"$f":"VLOOKUP(G46,List!B:C,2,0)","v":182},null,null,{"$f":"VLOOKUP(G46,List!B:E,4,0)","v":"dcsm-EF_MEA1_HV_OFF"},{"$f":"VLOOKUP(G46,List!B:G,6,0)","v":10},"2022-03-13T20:44:37","0000    CALL dcsm-EF_MEA1_HV_OFF -Run"]
[null,null,{"$f":"D47-H47/3600/24","v":"2022-03-13T20:52:56"},"2022-03-13T20:53:56",null,null,"MIA_HV_OFF",{"$f":"VLOOKUP(G47,List!B:C,2,0)","v":60},null,null,{"$f":"VLOOKUP(G47,List!B:E,4,0)","v":"dcsm-EF_MIA_HV_OFF"},{"$f":"VLOOKUP(G47,List!B:G,6,0)","v":1},"2022-03-13T20:47:39","0000    CALL dcsm-EF_MIA_HV_OFF -Run"]
[null,null,{"$f":"D48-H48/3600/24","v":"2022-03-13T20:53:56"},"2022-03-13T20:57:06",null,null,"HEP_HV_OFF",{"$f":"VLOOKUP(G48,List!B:C,2,0)","v":190},null,null,{"$f":"VLOOKUP(G48,List!B:E,4,0)","v":"dcsm-EF_HEPE_HV_OFF_OBS_OFF"},{"$f":"VLOOKUP(G48,List!B:G,6,0)","v":5},"2022-03-13T20:48:39","0000    CALL dcsm-EF_HEPE_HV_OFF_OBS_OFF -Run"]
[null,null,"2022-03-13T20:57:06",{"$f":"C49+H49/3600/24","v":"2022-03-13T21:17:06"},"WOL#3",null,{"$f":"(C50-D48)*24*3600","v":1800.0000002095476},1200,null,null,null,0,"2022-03-13T20:51:49",{"$f":"\"0000    WAIT_SEC  \"&TEXT(G49,\"#0\")","v":"0000    WAIT_SEC  1800"}]
[null,null,{"$f":"D49+10/60/24","v":"2022-03-13T21:27:06"},{"$f":"C50+H50/3600/24","v":"2022-03-13T21:31:36"},null,"SI HV ON","HEP_HV_ON",{"$f":"VLOOKUP(G50,List!B:C,2,0)","v":270},null,null,{"$f":"VLOOKUP(G50,List!B:E,4,0)","v":"dcsm-EF_HEPE_HV_ON_OBS_START"},{"$f":"VLOOKUP(G50,List!B:G,6,0)","v":6},"2022-03-13T21:21:49",{"$f":"+\"0000    CALL \"&K50&\" -Run\"","v":"0000    CALL dcsm-EF_HEPE_HV_ON_OBS_START -Run"}]
[null,null,{"$f":"D50","v":"2022-03-13T21:31:36"},"2022-03-13T21:35:58",null,null,"MIA_HV_ON_SW_RC",{"$f":"VLOOKUP(G51,List!B:C,2,0)","v":262},null,null,{"$f":"VLOOKUP(G51,List!B:E,4,0)","v":"dcsm-EF_MIA_HV_ON_SW_RC"},{"$f":"VLOOKUP(G51,List!B:G,6,0)","v":7},"2022-03-13T21:26:19",{"$f":"+\"0000    CALL \"&K51&\" -Run\"","v":"0000    CALL dcsm-EF_MIA_HV_ON_SW_RC -Run"}]
[null,null,"2022-03-13T21:35:58","2022-03-13T22:04:20",null,null,"MEA1_HV_ON",{"$f":"VLOOKUP(G52,List!B:C,2,0)","v":1702},null,null,{"$f":"VLOOKUP(G52,List!B:E,4,0)","v":"dcsm-EF_MEA1_HV_ON"},{"$f":"VLOOKUP(G52,List!B:G,6,0)","v":27},"2022-03-13T21:30:41","0000    CALL dcsm-EF_MEA1_HV_ON -Run"]
[null,null,"2022-03-13T22:04:20","2022-03-13T22:30:33",null,null,"MSA_HV_ON_1_MFB_SF",{"$f":"VLOOKUP(G53,List!B:C,2,0)","v":1573},null,null,{"$f":"VLOOKUP(G53,List!B:E,4,0)","v":"dcsm-EF_MSA_HV_ON_1_MFB_Safe"},{"$f":"VLOOKUP(G53,List!B:G,6,0)","v":108},"2022-03-13T21:59:03","0000    CALL dcsm-EF_MSA_HV_ON_1_MFB_Safe -Run"]
[null,null,"2022-03-13T22:30:33","2022-03-13T23:01:33",null,null,"MSA_HV_ON_2_MFB_SF",{"$f":"VLOOKUP(G54,List!B:C,2,0)","v":1860},null,null,{"$f":"VLOOKUP(G54,List!B:E,4,0)","v":"dcsm-EF_MSA_HV_ON_2_MFB_Safe"},{"$f":"VLOOKUP(G54,List!B:G,6,0)","v":124},"2022-03-13T22:25:16","0000    CALL dcsm-EF_MSA_HV_ON_2_MFB_Safe -Run"]
[null,null,"2022-03-13T23:01:33","2022-03-13T23:02:15",null,"TLM mode change (MODE_5)","TLM_MODE_5",{"$f":"VLOOKUP(G55,List!B:C,2,0)","v":42},null,null,{"$f":"VLOOKUP(G55,List!B:E,4,0)","v":"dcsm-EF_BUS_TLM_MODE_5"},{"$f":"VLOOKUP(G55,List!B:G,6,0)","v":2},"2022-03-13T22:56:16","0000    CALL dcsm-EF_BUS_TLM_MODE_5 -Run"]
[null,null,"2022-03-13T23:02:15",{"$f":"C57","v":"2022-03-14T20:44:30"},"Observation D",null,null,{"$f":"(D56-C56)*3600*24","v":78135.000000405125},{"$f":"H56/3600","v":21.704166666779201},null,null,0,"2022-03-13T22:56:58",{"$f":"\"0000    WAIT_SEC  \"&TEXT(H56,\"#0\")","v":"0000    WAIT_SEC  78135"}]
[null,null,{"$f":"D57-H57/3600/24","v":"2022-03-14T20:44:30"},{"$f":"C58","v":"2022-03-14T20:45:12"},null,"TLM mode change (MODE_10)","TLM_MODE_10",{"$f":"VLOOKUP(G57,List!B:C,2,0)","v":42},null,null,{"$f":"VLOOKUP(G57,List!B:E,4,0)","v":"dcsm-EF_BUS_TLM_MODE_10"},{"$f":"VLOOKUP(G57,List!B:G,6,0)","v":2},"2022-03-14T20:39:13",{"$f":"+\"0000    CALL \"&K57&\" -Run\"","v":"0000    CALL dcsm-EF_BUS_TLM_MODE_10 -Run"}]
[null,null,{"$f":"D58-H58/3600/24","v":"2022-03-14T20:45:12"},{"$f":"C59","v":"2022-03-14T20:58:06"},null,"SI HV OFF","MSA_HV_OFF_VFB",{"$f":"VLOOKUP(G58,List!B:C,2,0)","v":774},null,null,{"$f":"VLOOKUP(G58,List!B:E,4,0)","v":"dcsm-EF_MSA_HV_OFF_VFB"},{"$f":"VLOOKUP(G58,List!B:G,6,0)","v":25},"2022-03-14T20:39:55","0000    CALL dcsm-EF_MSA_HV_OFF_VFB -Run"]
[null,null,"2022-03-14T20:58:06","2022-03-14T21:01:08",null,null,"MEA1_HV_OFF",{"$f":"VLOOKUP(G59,List!B:C,2,0)","v":182},null,null,{"$f":"VLOOKUP(G59,List!B:E,4,0)","v":"dcsm-EF_MEA1_HV_OFF"},{"$f":"VLOOKUP(G59,List!B:G,6,0)","v":10},"2022-03-14T20:52:49","0000    CALL dcsm-EF_MEA1_HV_OFF -Run"]
[null,null,{"$f":"D60-H60/3600/24","v":"2022-03-14T21:01:08"},"2022-03-14T21:02:08",null,null,"MIA_HV_OFF",{"$f":"VLOOKUP(G60,List!B:C,2,0)","v":60},null,null,{"$f":"VLOOKUP(G60,List!B:E,4,0)","v":"dcsm-EF_MIA_HV_OFF"},{"$f":"VLOOKUP(G60,List!B:G,6,0)","v":1},"2022-03-14T20:55:51","0000    CALL dcsm-EF_MIA_HV_OFF -Run"]
[null,null,{"$f":"D61-H61/3600/24","v":"2022-03-14T21:02:08"},"2022-03-14T21:05:18",null,null,"HEP_HV_OFF",{"$f":"VLOOKUP(G61,List!B:C,2,0)","v":190},null,null,{"$f":"VLOOKUP(G61,List!B:E,4,0)","v":"dcsm-EF_HEPE_HV_OFF_OBS_OFF"},{"$f":"VLOOKUP(G61,List!B:G,6,0)","v":5},"2022-03-14T20:56:51","0000    CALL dcsm-EF_HEPE_HV_OFF_OBS_OFF -Run"]
[null,null,"2022-03-14T21:05:18",{"$f":"C62+H62/3600/24","v":"2022-03-14T21:25:18"},"WOL#4",null,{"$f":"(C63-D61)*24*3600","v":1800.0000002095476},1200,null,null,null,0,"2022-03-14T21:00:01",{"$f":"\"0000    WAIT_SEC  \"&TEXT(G62,\"#0\")","v":"0000    WAIT_SEC  1800"}]
[null,null,{"$f":"D62+10/60/24","v":"2022-03-14T21:35:18"},{"$f":"C63+H63/3600/24","v":"2022-03-14T21:39:48"},null,"SI HV ON","HEP_HV_ON",{"$f":"VLOOKUP(G63,List!B:C,2,0)","v":270},null,null,{"$f":"VLOOKUP(G63,List!B:E,4,0)","v":"dcsm-EF_HEPE_HV_ON_OBS_START"},{"$f":"VLOOKUP(G63,List!B:G,6,0)","v":6},"2022-03-14T21:30:01",{"$f":"+\"0000    CALL \"&K63&\" -Run\"","v":"0000    CALL dcsm-EF_HEPE_HV_ON_OBS_START -Run"}]
[null,null,{"$f":"D63","v":"2022-03-14T21:39:48"},"2022-03-14T21:44:10",null,null,"MIA_HV_ON_SW_RC",{"$f":"VLOOKUP(G64,List!B:C,2,0)","v":262},null,null,{"$f":"VLOOKUP(G64,List!B:E,4,0)","v":"dcsm-EF_MIA_HV_ON_SW_RC"},{"$f":"VLOOKUP(G64,List!B:G,6,0)","v":7},"2022-03-14T21:34:31",{"$f":"+\"0000    CALL \"&K64&\" -Run\"","v":"0000    CALL dcsm-EF_MIA_HV_ON_SW_RC -Run"}]
[null,null,"2022-03-14T21:44:10","2022-03-14T22:12:32",null,null,"MEA1_HV_ON",{"$f":"VLOOKUP(G65,List!B:C,2,0)","v":1702},null,null,{"$f":"VLOOKUP(G65,List!B:E,4,0)","v":"dcsm-EF_MEA1_HV_ON"},{"$f":"VLOOKUP(G65,List!B:G,6,0)","v":27},"2022-03-14T21:38:53","0000    CALL dcsm-EF_MEA1_HV_ON -Run"]
[null,null,"2022-03-14T22:12:32","2022-03-14T22:38:45",null,null,"MSA_HV_ON_1_MFB_SF",{"$f":"VLOOKUP(G66,List!B:C,2,0)","v":1573},null,null,{"$f":"VLOOKUP(G66,List!B:E,4,0)","v":"dcsm-EF_MSA_HV_ON_1_MFB_Safe"},{"$f":"VLOOKUP(G66,List!B:G,6,0)","v":108},"2022-03-14T22:07:15","0000    CALL dcsm-EF_MSA_HV_ON_1_MFB_Safe -Run"]
[null,null,"2022-03-14T22:38:45","2022-03-14T23:09:45",null,null,"MSA_HV_ON_2_MFB_SF",{"$f":"VLOOKUP(G67,List!B:C,2,0)","v":1860},null,null,{"$f":"VLOOKUP(G67,List!B:E,4,0)","v":"dcsm-EF_MSA_HV_ON_2_MFB_Safe"},{"$f":"VLOOKUP(G67,List!B:G,6,0)","v":124},"2022-03-14T22:33:28","0000    CALL dcsm-EF_MSA_HV_ON_2_MFB_Safe -Run"]
[null,null,"2022-03-14T23:09:45","2022-03-14T23:10:27",null,"TLM mode change (MODE_5)","TLM_MODE_5",{"$f":"VLOOKUP(G68,List!B:C,2,0)","v":42},null,null,{"$f":"VLOOKUP(G68,List!B:E,4,0)","v":"dcsm-EF_BUS_TLM_MODE_5"},{"$f":"VLOOKUP(G68,List!B:G,6,0)","v":2},"2022-03-14T23:04:28","0000    CALL dcsm-EF_BUS_TLM_MODE_5 -Run"]
[null,null,"2022-03-14T23:10:27",{"$f":"C70","v":"2022-03-15T05:23:30"},"Observation E",null,null,{"$f":"(D69-C69)*3600*24","v":22382.99999947194},{"$f":"H69/3600","v":6.2174999998533167},null,null,0,"2022-03-14T23:05:10",{"$f":"\"0000    WAIT_SEC  \"&TEXT(H69,\"#0\")","v":"0000    WAIT_SEC  22383"}]
[null,null,{"$f":"D70-H70/3600/24","v":"2022-03-15T05:23:30"},{"$f":"C71","v":"2022-03-15T05:24:12"},null,"TLM mode change (MODE_10)","TLM_MODE_10",{"$f":"VLOOKUP(G70,List!B:C,2,0)","v":42},null,null,{"$f":"VLOOKUP(G70,List!B:E,4,0)","v":"dcsm-EF_BUS_TLM_MODE_10"},{"$f":"VLOOKUP(G70,List!B:G,6,0)","v":2},{"$f":"C70-317/3600/24","v":"2022-03-15T05:18:13"},{"$f":"+\"0000    CALL \"&K70&\" -Run\"","v":"0000    CALL dcsm-EF_BUS_TLM_MODE_10 -Run"}]
[null,null,{"$f":"D71-H71/3600/24","v":"2022-03-15T05:24:12"},{"$f":"C72","v":"2022-03-15T05:37:06"},null,"SI HV OFF","MSA_HV_OFF_VFB",{"$f":"VLOOKUP(G71,List!B:C,2,0)","v":774},null,null,{"$f":"VLOOKUP(G71,List!B:E,4,0)","v":"dcsm-EF_MSA_HV_OFF_VFB"},{"$f":"VLOOKUP(G71,List!B:G,6,0)","v":25},"2022-03-15T05:18:55","0000    CALL dcsm-EF_MSA_HV_OFF_VFB -Run"]
[null,null,"2022-03-15T05:37:06","2022-03-15T05:40:12",null,null,"MEA1_HV_SCAN_OFF",{"$f":"VLOOKUP(G72,List!B:C,2,0)","v":186},null,null,{"$f":"VLOOKUP(G72,List!B:E,4,0)","v":"dcsm-EF_MEA1_HV_SCAN_OFF"},{"$f":"VLOOKUP(G72,List!B:G,6,0)","v":12},"2022-03-15T05:31:49","0000    CALL dcsm-EF_MEA1_HV_SCAN_OFF -Run"]
[null,null,{"$f":"D73-H73/3600/24","v":"2022-03-15T05:40:12"},"2022-03-15T05:41:12",null,null,"MIA_HV_OFF",{"$f":"VLOOKUP(G73,List!B:C,2,0)","v":60},null,null,{"$f":"VLOOKUP(G73,List!B:E,4,0)","v":"dcsm-EF_MIA_HV_OFF"},{"$f":"VLOOKUP(G73,List!B:G,6,0)","v":1},"2022-03-15T05:34:55","0000    CALL dcsm-EF_MIA_HV_OFF -Run"]
[null,null,{"$f":"D74-H74/3600/24","v":"2022-03-15T05:41:12"},"2022-03-15T05:44:22",null,null,"HEP_HV_OFF",{"$f":"VLOOKUP(G74,List!B:C,2,0)","v":190},null,null,{"$f":"VLOOKUP(G74,List!B:E,4,0)","v":"dcsm-EF_HEPE_HV_OFF_OBS_OFF"},{"$f":"VLOOKUP(G74,List!B:G,6,0)","v":5},"2022-03-15T05:35:55","0000    CALL dcsm-EF_HEPE_HV_OFF_OBS_OFF -Run"]
[null,null,{"$f":"D75-H75/3600/24","v":"2022-03-15T05:44:22"},{"$f":"C76","v":"2022-03-15T05:45:32"},null,"SI Power ON","HEP_OFF",{"$f":"VLOOKUP(G75,List!B:C,2,0)","v":70},null,null,{"$f":"VLOOKUP(G75,List!B:E,4,0)","v":"dcsm-EF_HEPE_OFF_STOP"},{"$f":"VLOOKUP(G75,List!B:G,6,0)","v":4},"2022-03-15T05:39:05",{"$f":"+\"0000    CALL \"&K75&\" -Run\"","v":"0000    CALL dcsm-EF_HEPE_OFF_STOP -Run"}]
[null,null,"2022-03-15T05:45:32",{"$f":"C77","v":"2022-03-15T05:48:12"},null,null,"MEA1_OFF",{"$f":"VLOOKUP(G76,List!B:C,2,0)","v":160},null,null,{"$f":"VLOOKUP(G76,List!B:E,4,0)","v":"dcsm-EF_MEA1_OFF"},{"$f":"VLOOKUP(G76,List!B:G,6,0)","v":4},"2022-03-15T05:40:15",{"$f":"+\"0000    CALL \"&K76&\" -Run\"","v":"0000    CALL dcsm-EF_MEA1_OFF -Run"}]
[null,null,"2022-03-15T05:48:12","2022-03-15T05:48:20",null,null,"MGF_OFF",{"$f":"VLOOKUP(G77,List!B:C,2,0)","v":8},null,null,{"$f":"VLOOKUP(G77,List!B:E,4,0)","v":"dcsm-EF_MGF_OFF"},{"$f":"VLOOKUP(G77,List!B:G,6,0)","v":1},"2022-03-15T05:42:55","0000    CALL dcsm-EF_MGF_OFF -Run"]
[null,null,"2022-03-15T05:48:20","2022-03-15T05:49:00",null,null,"PME_OFF",{"$f":"VLOOKUP(G78,List!B:C,2,0)","v":40},null,null,{"$f":"VLOOKUP(G78,List!B:E,4,0)","v":"dcsm-EF_PME_OFF"},{"$f":"VLOOKUP(G78,List!B:G,6,0)","v":1},"2022-03-15T05:43:03","0000    CALL dcsm-EF_PME_OFF -Run"]
[null,null,"2022-03-15T05:49:00",{"$f":"C80","v":"2022-03-15T05:51:40"},null,null,"MIA_OFF",{"$f":"VLOOKUP(G79,List!B:C,2,0)","v":160},null,null,{"$f":"VLOOKUP(G79,List!B:E,4,0)","v":"dcsm-EF_MIA_OFF"},{"$f":"VLOOKUP(G79,List!B:G,6,0)","v":4},"2022-03-15T05:43:43","0000    CALL dcsm-EF_MIA_OFF -Run"]
[null,null,"2022-03-15T05:51:40",{"$f":"C81","v":"2022-03-15T05:58:00"},null,null,"MSA_OFF",{"$f":"VLOOKUP(G80,List!B:C,2,0)","v":380},null,null,{"$f":"VLOOKUP(G80,List!B:E,4,0)","v":"dcsm-EF_MSA_OFF"},{"$f":"VLOOKUP(G80,List!B:G,6,0)","v":25},"2022-03-15T05:46:23","0000    CALL dcsm-EF_MSA_OFF -Run"]
[null,null,"2022-03-15T05:58:00",{"$f":"C82","v":"2022-03-15T06:00:00"},null,"MDP OFF","MDP_OFF_D",{"$f":"VLOOKUP(G81,List!B:C,2,0)","v":120},null,null,{"$f":"VLOOKUP(G81,List!B:E,4,0)","v":"dcsm-EF_MDP_POWEROFF"},{"$f":"VLOOKUP(G81,List!B:G,6,0)","v":3},"2022-03-15T05:52:43","0000    CALL dcsm-EF_MDP_POWEROFF -Run"]
[null,null,"2022-03-15T06:00:00",{"$f":"C82+H82/3600/24","v":"2022-03-15T06:20:00"},null,null,"END",1200,null,null,null,{"$f":"VLOOKUP(G82,List!B:G,6,0)","v":{"$error":"#N/A"}},"2022-03-15T05:54:43"]