{"text_format":"1","workbook":"xlsx","n_sheets":11,"sheets":["確認事項","変更履歴","実行","チェック表","START","END","LOOP","COMMENT","List","WOL","obs_sequence"],"not_rendered":{"charts":0,"images":0,"macros":1,"external_links":0,"defined_names":6,"comments":0,"pivot_tables":0},"unopened":[],"bounds":{"document_bytes":16777216,"sheet_cells":100000,"rows_first":2000,"rows_last":500,"rows_between":2000,"halvings":0,"cell_chars":16384,"cell_head_chars":4096},"cells_cut":0,"cells_raw":0,"read":"whole","date_system":"1900"}

{"sheet":"確認事項","index":0,"n_rows":1,"n_cols":4,"rows_kept":1,"cut":false,"hidden":false,"merged":[]}
["NO.","確認事項","回答","CLOSE"]

{"sheet":"変更履歴","index":1,"n_rows":10,"n_cols":4,"rows_kept":10,"cut":false,"hidden":false,"merged":[[0,0,0,3]]}
["MMO観測計画作成ツール　変更履歴"]
["日付","Ver","変更者","変更内容"]
["2021-08-06",1,"山下","-"]
["2021-08-09",2,"arare","コマンド出力のmain　end部分を出力するように修正した\nListにMSA_HV_ON_VFB1、MSA_HV_ON_VFB2追加\nObs_sequence XOR Time行追記\nコマンドの開始終了時間をOBS時間に変更"]
["2021-08-17",3,"arare","WOLの時間をG列から取得するように変更"]
["2021-08-25",4,"arare","COMMENTにmainstart,endのXDOR,XOR用追記"]
["2021-09-27",5,"arare","＃refの対応 obserbation Aから昇順につける"]
["2021-10-19",6,"arare","ListにMSAHV追記"]
["2021-10-21",7,"arare","Listを最新にした"]
["2022-03-08",8,"arare","Listを最新にした、XDOR用コメントはプログラム改修により使用なし"]

{"sheet":"実行","index":2,"n_rows":16,"n_cols":6,"rows_kept":16,"cut":false,"hidden":false,"merged":[]}
[]
[]
[]
[]
[]
[]
[]
[null,null,null,null,null,"【操作】"]
["C番号",990,null,null,null,"「実行」シートの「観測作成」を押下。"]
["M番号",631204,null,null,null,"→「START」、「LOOP」、「END」を「obs_sequence」に貼り付けます。"]
[null,null,null,null,null,"「実行」シートの「時刻反映」を押下。"]
[null,null,null,null,null,"→WOLの時間と関数エラーとなっているセルを修正します。"]
[null,null,null,null,null,"【注意点】"]
[null,null,null,null,null,"「START」、「LOOP」、「END」の\"cmd count\"からシート内に何行あるかを取得しているので、ここは空白がないように\"0”を入力してください。"]
[null,null,null,null,null,"もし空白があった場合、コピー範囲が小さくなってしまいます。"]
[null,null,null,null,null,"”WOL”シートの4行目以下は、実施するWOLのみを記載すること。\n(4行目以下に、期間開始日時と終了日時の記載は不要です。)"]

{"sheet":"チェック表","index":3,"n_rows":19,"n_cols":4,"rows_kept":19,"cut":false,"hidden":true,"merged":[]}
[]
[null,"コマンド作成時注意項目"]
[null,"NO.","項目","チェック"]
[null,1,"\n観測期間開始時に「dcsm-EF_BUS_MONI_ON」手順が入っていることを確認する。\nただし、前回の観測終了時に「dcsm-EF_BUS_MONI_OFF」を実行していない場合は確認不要。\n","□"]
[null,2,"\n観測期間開始日に、観測する機器の”ON”手順が入っていることを確認する。\nただし、PWI、MGF、MAST、WPTを\"ON\"にする場合は、PWI、MGF、MAST、WPTよりも先にPMEが\"ON\"となっていること。\n※クルーズ観測中は、MEA1,HEPE,MGFのみ”ON”\n","□"]
[null,3,"\nTLM MODEが観測前に「５」　観測終了後は「１０」　となっていることを確認する\n","□"]
[null,4,"\n観測時間が”86400”を超えるていないか確認する。\n超えていた場合は、main計画作成時に途中ダミーコマンドを挿入すること\n"]
[null,5,"WOLの開始時刻が正しいことを確認する","□"]
[null,6,"\nWOLの時間を確認　HV　OFFになっていることを確認する\n↓\nクルーズ観測を行っている機器(HEPE、ENA、MIA、MEA、MSAのみ)\nフライバイを行っている機器(MSA,PWI,MGF,MEA,ENA,MIA,HEPE,MDM)\n","□"]
[null,7,"\nWOL終了時刻＋10以降にのHVがONになっていることを確認する。\nクルーズ観測を行っている機器(HEPE、ENA、MIA、MEA、MSAのみ)\nフライバイを行っている機器(MSA,PWI,MGF,MEA,ENA,MIA,HEPE,MDM)\n","□"]
[null,8,"\n観測期間最終日に、観測を行った機器の”OFF”手順が入っていることを確認する。\nただし、PWI,MGF,MAST,WPT-OFF手順の後にPME-OFF手順が入っていることを確認する。\n","□"]
[null,9,"\nMDP_POWEROFFのあとにdcsm-MC_ENA_MDPが入っていることを確認する。\n","□"]
[null,10,"\nCELのMONI ONは長時間(1h以上の場合は、山下さんと要相談)しないこと　\nBUSにはCELのみのもあるので注意　dcsm-BUS_CEL_MONI_ON　dcsm-BUS_CEL_MONI_OFF\n","□"]
[null,11,"MEA1の  SCAN ON は　dcsm-EF_MEA1_ON_SW.cpsに入っているので\n　　　順番は　MDP ONして\n　　　　　　　dcsm-EF_MEA1_ON_SW.cps\n　　　　　　　dcsm-EF_MEA1_HV_ON.cps\n　　　　　　　dcsm-EF_MEA1_HV_OFF.cps\n　　　　　　　dcsm-EF_MEA1_HV_ON.cps\n　　　　　　　dcsm-EF_MEA1_HV_SCAN_OFF.cps\n　　　　　　　dcsm-EF_MEA1_OFF.cps\n　　　　　　　MDP　OFF\n　　　　　　　\n  　　　　　　dcsm-EF_MEA_ON_SW.cps\n　　　　　　　dcsm-EF_MEA_HV_ON.cps\n　　　　　　　dcsm-EF_MEA_HV_OFF.cps\n　　　　　　　dcsm-EF_MEA_HV_ON.cps\n　　　　　　　dcsm-EF_MEA_HV_SCAN_OFF.cps\n　　　　　　　dcsm-EF_MEA_OFF.cps\n\n　　　になる\n　SCAN OFFにすると　データが出てこない　HV OFF->ON時は注意する","□"]
[null,13,"2021/6/25以降　dcsm-EF_MSA_ON_C　が最新　dcsm-EF_MSA_ONは使用しない","□"]
[null,14,"2021/6/25以降　dcsm-CRCO_MIA_CHECK_C　が最新　dcsm-CRCO_MIA_CHECKは使用しない（クルーズチェックアウトの時）","□"]
[null,15,"2021/6/25以降　dcsm-CRCO_MSA_CHECK_C　が最新　dcsm-CRCO_MSA_CHECKは使用しない（クルーズチェックアウトの時）","□"]
[null,16,"フライバイ時、MIAのHV_ON時間帯によって違うので必ず確認する\nMIA_HV_ON_RC\nMIA_HV_ON_SW_RC\nMIA_HV_ON_MAG_RC","□"]
[null,17,"Excelの時間を確認する　時間通りになっているか","□"]

{"sheet":"START","index":4,"n_rows":8,"n_cols":21,"rows_kept":8,"cut":false,"hidden":false,"merged":[[5,5,7,5]]}
["Start","End","Start","End","Event","Activity","Procedure","Duration (sec)",null,null,null,"cmd count",null,"cmd count"]
[null,null,{"$f":"#REF!","v":{"$error":"#REF!"}},{"$f":"C2+H2/3600/24","v":{"$error":"#REF!"}},null,"BUS_ON","MDP_ON_D",{"$f":"VLOOKUP(G2,List!B:C,2,0)","v":509},null,null,{"$f":"VLOOKUP(G2,List!B:E,4,0)","v":"dcsm-EF_MDP_ON"},{"$f":"VLOOKUP(G2,List!B:G,6,0)","v":11},{"$f":"C2-317/3600/24","v":{"$error":"#REF!"}},{"$f":"+\"0000    CALL \"&K2&\" -Run\"","v":"0000    CALL dcsm-EF_MDP_ON -Run"},null,"CALL","dcsm-EF_BUS_MONI_ON",null,null,null,{"$f":"+IF(Q2=K2,\"\",\"x\")","v":"x"}]
[null,null,{"$f":"D2","v":{"$error":"#REF!"}},{"$f":"C3+H3/3600/24","v":{"$error":"#REF!"}},null,"MDP ON","MDP_CRUISE_SET",{"$f":"VLOOKUP(G3,List!B:C,2,0)","v":42},null,null,{"$f":"VLOOKUP(G3,List!B:E,4,0)","v":"dcsm-EF_MDP_CRUISE_SET"},{"$f":"VLOOKUP(G3,List!B:G,6,0)","v":2},{"$error":"#REF!"},"0000    CALL dcsm-EF_MDP_CRUISE_SET -Run",null,"CALL","dcsm-EF_MDP_ON",null,null,null,{"$f":"+IF(Q3=K3,\"\",\"x\")","v":"x"}]
[null,null,{"$f":"D3","v":{"$error":"#REF!"}},{"$f":"C4+H4/3600/24","v":{"$error":"#REF!"}},null,null,"TLM_MODE_10",{"$f":"VLOOKUP(G4,List!B:C,2,0)","v":42},null,null,{"$f":"VLOOKUP(G4,List!B:E,4,0)","v":"dcsm-EF_BUS_TLM_MODE_10"},{"$f":"VLOOKUP(G4,List!B:G,6,0)","v":2},{"$error":"#REF!"},"0000    CALL dcsm-EF_BUS_TLM_MODE_10 -Run"]
[null,null,{"$error":"#REF!"},{"$error":"#REF!"},null,"TLM mode change (MODE_10)","MEA1_ON_SETUP_SW",{"$f":"VLOOKUP(G5,List!B:C,2,0)","v":292},null,null,{"$f":"VLOOKUP(G5,List!B:E,4,0)","v":"dcsm-EF_MEA1_ON_SW"},{"$f":"VLOOKUP(G5,List!B:G,6,0)","v":12},{"$error":"#REF!"},"0000    CALL dcsm-EF_MEA1_ON_SW -Run"]
[null,null,{"$error":"#REF!"},{"$f":"C6+H6/3600/24","v":{"$error":"#REF!"}},null,"SI ON","HEP_ON_SETUP",{"$f":"VLOOKUP(G6,List!B:C,2,0)","v":1230},null,null,{"$f":"VLOOKUP(G6,List!B:E,4,0)","v":"dcsm-EF_HEP_ON_START_for_TL"},{"$f":"VLOOKUP(G6,List!B:G,6,0)","v":34},{"$error":"#REF!"},"0000    CALL dcsm-EF_HEP_ON_START_for_TL -Run"]
[null,null,{"$error":"#REF!"},{"$error":"#REF!"},null,null,"PME_ON",{"$f":"VLOOKUP(G7,List!B:C,2,0)","v":80},null,null,{"$f":"VLOOKUP(G7,List!B:E,4,0)","v":"dcsm-EF_PME_ON"},{"$f":"VLOOKUP(G7,List!B:G,6,0)","v":2},{"$error":"#REF!"},"0000    CALL dcsm-EF_PME_ON -Run",null,"CALL","dcsm-EF_MDP_CRUISE_SET",null,null,null,"x"]
[null,null,{"$error":"#REF!"},{"$error":"#REF!"},null,null,"MGF_ON_SETUP",{"$f":"VLOOKUP(G8,List!B:C,2,0)","v":14},null,null,{"$f":"VLOOKUP(G8,List!B:E,4,0)","v":"dcsm-EF_MGF_ON"},{"$f":"VLOOKUP(G8,List!B:G,6,0)","v":3},{"$error":"#REF!"},"0000    CALL dcsm-EF_MGF_ON -Run",null,"CALL","dcsm-EF_BUS_TLM_MODE_10",null,null,null,"x"]

{"sheet":"END","index":5,"n_rows":6,"n_cols":21,"rows_kept":6,"cut":false,"hidden":false,"merged":[[1,5,4,5]]}
["Start","End","Start","End","Event","Activity","Procedure","Duration (sec)",null,null,null,"cmd count",null,"cmd count"]
[null,null,{"$f":"D2-H2/3600/24","v":{"$error":"#REF!"}},{"$f":"C3","v":{"$error":"#REF!"}},null,"SI OFF","HEP_OFF",{"$f":"VLOOKUP(G2,List!B:C,2,0)","v":70},null,null,{"$f":"VLOOKUP(G2,List!B:E,4,0)","v":"dcsm-EF_HEPE_OFF_STOP"},{"$f":"VLOOKUP(G2,List!B:G,6,0)","v":4},{"$f":"C2-317/3600/24","v":{"$error":"#REF!"}},{"$f":"+\"0000    CALL \"&K2&\" -Run\"","v":"0000    CALL dcsm-EF_HEPE_OFF_STOP -Run"},null,"CALL","dcsm-EF_HEPE_OFF_STOP",null,null,null,{"$f":"+IF(Q2=K2,\"\",\"x\")","v":""}]
[null,null,{"$error":"#REF!"},{"$error":"#REF!"},null,null,"MEA1_OFF",{"$f":"VLOOKUP(G3,List!B:C,2,0)","v":160},null,null,{"$f":"VLOOKUP(G3,List!B:E,4,0)","v":"dcsm-EF_MEA1_OFF"},{"$f":"VLOOKUP(G3,List!B:G,6,0)","v":4},{"$error":"#REF!"},{"$f":"+\"0000    CALL \"&K3&\" -Run\"","v":"0000    CALL dcsm-EF_MEA1_OFF -Run"},null,"CALL","dcsm-EF_MEA1_OFF",null,null,null,""]
[null,null,{"$error":"#REF!"},{"$error":"#REF!"},null,null,"MGF_OFF",{"$f":"VLOOKUP(G4,List!B:C,2,0)","v":8},null,null,{"$f":"VLOOKUP(G4,List!B:E,4,0)","v":"dcsm-EF_MGF_OFF"},{"$f":"VLOOKUP(G4,List!B:G,6,0)","v":1},{"$error":"#REF!"},"0000    CALL dcsm-EF_MGF_OFF -Run",null,"CALL","dcsm-EF_MGF_OFF",null,null,null,""]
[null,null,{"$error":"#REF!"},{"$f":"#REF!","v":{"$error":"#REF!"}},null,null,"PME_OFF",{"$f":"VLOOKUP(G5,List!B:C,2,0)","v":40},null,null,{"$f":"VLOOKUP(G5,List!B:E,4,0)","v":"dcsm-EF_PME_OFF"},{"$f":"VLOOKUP(G5,List!B:G,6,0)","v":1},{"$error":"#REF!"},"0000    CALL dcsm-EF_PME_OFF -Run",null,"CALL","dcsm-EF_PME_OFF",null,null,null,""]
[null,null,{"$f":"#REF!","v":{"$error":"#REF!"}},{"$f":"C6+H6/3600/24","v":{"$error":"#REF!"}},{"$f":"#REF!","v":{"$error":"#REF!"}},null,"END",1200,null,null,{"$f":"VLOOKUP(G6,List!B:E,4,0)","v":{"$error":"#N/A"}},0,{"$error":"#REF!"}]

{"sheet":"LOOP","index":6,"n_rows":9,"n_cols":21,"rows_kept":9,"cut":false,"hidden":false,"merged":[[1,5,2,5],[6,5,7,5]]}
["Start","End","Start","End","Event","Activity","Procedure","Duration (sec)",null,null,null,"cmd count",null,"cmd count"]
[null,null,{"$f":"#REF!","v":{"$error":"#REF!"}},{"$f":"C2+H2/3600/24","v":{"$error":"#REF!"}},null,"SI HV ON","MEA1_HV_ON",{"$f":"VLOOKUP(G2,List!B:C,2,0)","v":1702},null,null,{"$f":"VLOOKUP(G2,List!B:E,4,0)","v":"dcsm-EF_MEA1_HV_ON"},{"$f":"VLOOKUP(G2,List!B:G,6,0)","v":27},{"$f":"C2-317/3600/24","v":{"$error":"#REF!"}},{"$f":"+\"0000    CALL \"&K2&\" -Run\"","v":"0000    CALL dcsm-EF_MEA1_HV_ON -Run"},null,"CALL","dcsm-EF_MEA1_HV_ON",null,null,null,{"$f":"+IF(Q2=K2,\"\",\"x\")","v":""}]
[null,null,{"$f":"D2","v":{"$error":"#REF!"}},{"$error":"#REF!"},null,null,"HEP_HV_ON",{"$f":"VLOOKUP(G3,List!B:C,2,0)","v":270},null,null,{"$f":"VLOOKUP(G3,List!B:E,4,0)","v":"dcsm-EF_HEPE_HV_ON_OBS_START"},{"$f":"VLOOKUP(G3,List!B:G,6,0)","v":6},{"$error":"#REF!"},{"$f":"+\"0000    CALL \"&K3&\" -Run\"","v":"0000    CALL dcsm-EF_HEPE_HV_ON_OBS_START -Run"},null,"CALL","dcsm-EF_HEPE_HV_ON_OBS_START",null,null,null,""]
[null,null,{"$error":"#REF!"},{"$error":"#REF!"},null,"TLM mode change (MODE_5)","TLM_MODE_5",{"$f":"VLOOKUP(G4,List!B:C,2,0)","v":42},null,null,{"$f":"VLOOKUP(G4,List!B:E,4,0)","v":"dcsm-EF_BUS_TLM_MODE_5"},{"$f":"VLOOKUP(G4,List!B:G,6,0)","v":2},{"$error":"#REF!"},"0000    CALL dcsm-EF_BUS_TLM_MODE_5 -Run",null,"CALL","dcsm-EF_BUS_TLM_MODE_5",null,null,null,""]
[null,null,{"$error":"#REF!"},{"$f":"C6","v":{"$error":"#REF!"}},"Observation I",null,null,{"$f":"(D5-C5)*3600*24","v":{"$error":"#REF!"}},{"$f":"H5/3600","v":{"$error":"#REF!"}},null,null,0,{"$error":"#REF!"},{"$f":"\"0000    WAIT_SEC  \"&TEXT(H5,\"#0\")","v":{"$error":"#REF!"}},null,"WAIT_SEC",26900,null,null,null,"x"]
[null,null,{"$f":"D6-H6/3600/24","v":{"$error":"#REF!"}},{"$f":"C7","v":{"$error":"#REF!"}},null,"TLM mode change (MODE_10)","TLM_MODE_10",{"$f":"VLOOKUP(G6,List!B:C,2,0)","v":42},null,null,{"$f":"VLOOKUP(G6,List!B:E,4,0)","v":"dcsm-EF_BUS_TLM_MODE_10"},{"$f":"VLOOKUP(G6,List!B:G,6,0)","v":2},{"$error":"#REF!"},{"$f":"+\"0000    CALL \"&K6&\" -Run\"","v":"0000    CALL dcsm-EF_BUS_TLM_MODE_10 -Run"},null,"CALL","dcsm-EF_BUS_TLM_MODE_10",null,null,null,""]
[null,null,{"$f":"D7-H7/3600/24","v":{"$error":"#REF!"}},{"$f":"C8","v":{"$error":"#REF!"}},null,"SI HV OFF","HEP_HV_OFF",{"$f":"VLOOKUP(G7,List!B:C,2,0)","v":190},null,null,{"$f":"VLOOKUP(G7,List!B:E,4,0)","v":"dcsm-EF_HEPE_HV_OFF_OBS_OFF"},{"$f":"VLOOKUP(G7,List!B:G,6,0)","v":5},{"$error":"#REF!"},"0000    CALL dcsm-EF_HEPE_HV_OFF_OBS_OFF -Run",null,"CALL","dcsm-EF_HEPE_HV_OFF_OBS_OFF",null,null,null,""]
[null,null,{"$f":"D8-H8/3600/24","v":{"$error":"#REF!"}},{"$f":"C9","v":{"$error":"#REF!"}},null,null,"MEA1_HV_OFF",{"$f":"VLOOKUP(G8,List!B:C,2,0)","v":182},null,null,{"$f":"VLOOKUP(G8,List!B:E,4,0)","v":"dcsm-EF_MEA1_HV_OFF"},{"$f":"VLOOKUP(G8,List!B:G,6,0)","v":10},{"$error":"#REF!"},"0000    CALL dcsm-EF_MEA1_HV_OFF -Run",null,"CALL","dcsm-EF_MEA1_HV_OFF",null,null,null,""]
[null,null,{"$f":"#REF!","v":{"$error":"#REF!"}},{"$f":"C9+H9/3600/24","v":{"$error":"#REF!"}},"WOL",null,{"$f":"(#REF!-D8)*24*3600","v":{"$error":"#REF!"}},1200,null,null,{"$f":"VLOOKUP(G9,#REF!,4,0)","v":{"$error":"#REF!"}},0,{"$error":"#REF!"},{"$f":"\"0000    WAIT_SEC  \"&TEXT(G9,\"#0\")","v":{"$error":"#REF!"}},null,"WAIT_SEC",1800,null,null,null,{"$error":"#REF!"}]

{"sheet":"COMMENT","index":7,"n_rows":24,"n_cols":3,"rows_kept":24,"cut":false,"hidden":false,"merged":[]}
["activity","Comment"]
["main_start","#!HEAD: main2-CROUSE_OBS6_XDOR_001_M63 2021-07-01 01:18:36 478        45 MMO                  MAIN2               // Earth Fly-by                \n0001  . # LET                  @ONERR=NEXT                   \n0002  . # ==========================================================================\n0003    #  <startTime>2021-07-06T08:00:00Z</startTime>\n0004    #  <stopTime>2021-07-15T10:00:00Z</stopTime>\n0005    #  << XDOR:XDOR_BJXR_C%%%_CRCO_M&&&&&&_00001.BC >> 連続送信*****\n0006    #  << XOR:XOR__BJXR_C%%%_CRCO_M&&&&&&_00001.BC >> *****\n0007    # ==========================================================================\n0008    # ==========================================================================\n0009  . #  EXEC_AT 2021-07-06 08:00:00\n0010    # ◆◇◆◇◆◇◆◇◆◇◆◇◆◇◆◇◆◇◆◇◆◇◆◇◆◇◆◇◆◇◆◇◆◇◆◇◆\n0015    # ==========================================================================\n0016    # 0. MMO MOSIF Heater &  Switch to Standby Mode\n0017    # ==========================================================================\n0018    #"]
["main_end","0122    # ==========================================================================\n0123    # 99. MMO Dormant Mode\n0124    # ==========================================================================\n0125    WAIT_SEC             240                   \n0126    #\n0127    # MMO Set HK rate to 1 second   (3sec)\n0128    # <forMPO>AJXF004A</forMPO>\n0129    WAIT_SEC             120                 \n0130    #\n0131    # MMO Switch to Dormant Mode  (70sec)\n0132    # <forMPO>AJXF002A</forMPO>\n0133    WAIT_SEC             300                   \n0134    #\n0135    # Return MOSIF heater setting   (14sec)\n0136    # <forMPO>AJXF017B</forMPO>                   \n0291    #############################################################################"]
["OBS","0068    # ==========================================================================\n0069    # @@. Observation \\\\\n0070    # ==========================================================================\n0071    #"]
["WOL","0217    # ==========================================================================\n0218    # @@. WOL # $$\n0219    # ==========================================================================\n0220    #"]
["BUS_ON","0016    # ==========================================================================\n0017    # @@. BUS ON \n0018    # ==========================================================================\n0019    #"]
["MDP ON","0020    # ==========================================================================\n0021    # @@. MDP ON\n0022    # ==========================================================================\n0023    #"]
["SI Check"]
["MDP OFF","0274    # ==========================================================================\n0275    # @@. MDP OFF\n0276    # ==========================================================================\n0277    #"]
["BUS OFF","0285    # ==========================================================================\n0286    # @@. BUS MONI OFF\n0287    # ==========================================================================\n0288    #"]
["SI ON","0034    # ==========================================================================\n0035    # @@.  PI POWER ON\n0036    # ==========================================================================\n0037    #"]
["SI HV ON","0049    # ==========================================================================\n0050    # @@.  PI HV ON\n0051    # ==========================================================================\n0052    #"]
["TLM mode change (MODE_5)","0059    # ==========================================================================\n0060    # @@. TLM MODE 5  (Mission: 7kbps, without user HK)\n0061    # ==========================================================================\n0062    #"]
["TLM mode change (MODE_10)","0028    # ==========================================================================\n0029    # @@. TLM MODE 10 (Mission: 4kbps, with user HK)\n0030    # ==========================================================================\n0031    #"]
["SI HV OFF","0207    # ==========================================================================\n0208    # @@. PI HV OFF\n0209    # ==========================================================================\n0210    #"]
["SI OFF","0259    # ==========================================================================\n0260    # @@. PI Power OFF\n0261    # ==========================================================================\n0262    #"]
["MSA SOFT RESET"]
["MACRO COMMAND ENA","0280    # ==========================================================================\n0281    # @@. MACRO ENA \n0282    # ==========================================================================\n0283    #"]
["CrouseCheckOut"]
[]
["main_start(XDOR)","#!HEAD: main2-CROUSE_OBS6_XDOR_001_M63 2021-07-01 01:18:36 478        45 MMO                  MAIN2               // Earth Fly-by                \n0001  . # LET                  @ONERR=NEXT                   \n0002  . # ==========================================================================\n0003    #  <startTime>2021-07-06T08:00:00Z</startTime>\n0004    #  <stopTime>2021-07-15T10:00:00Z</stopTime>\n0005    #  << XDOR:XDOR_BJXR_C%%%_CRCO_M&&&&&&_00001.BC >> 連続送信*****\n0006    #  << XOR:XOR__BJXR_C%%%_CRCO_M&&&&&&_00001.BC >> *****\n0007    # ==========================================================================\n0008    # ==========================================================================\n0009  . #  EXEC_AT 2021-07-06 08:00:00\n0010    # ◆◇◆◇◆◇◆◇◆◇◆◇◆◇◆◇◆◇◆◇◆◇◆◇◆◇◆◇◆◇◆◇◆◇◆◇◆\n0015    # ==========================================================================\n0016    # 0. MMO MOSIF Heater &  Switch to Standby Mode\n0017    # ==========================================================================\n0018    #\n0019    # Change MOSIF Heater Setting   (14sec)\n0020    # <forMPO>AJXF017A</forMPO>     \n0021    WAIT_SEC             42586                \n0022    #\n0023    # MMO Switch to Standby Mode (main) (300sec)\n0024    # <forMPO>AJXF001A</forMPO> \n0025    WAIT_SEC             60                   \n0026    #\n0027    # MMO Set HK rate to 64 second  (3sec)\n0028    # <forMPO>AJXF005A</forMPO> \n0029    WAIT_SEC              237                  \n0030    #","仕様変更により使用しない"]
["main_start(XOR)","#!HEAD: main2-CROUSE_OBS6_XDOR_001_M63 2021-07-01 01:18:36 478        45 MMO                  MAIN2               // Earth Fly-by                \n0001  . # LET                  @ONERR=NEXT                   \n0002  . # ==========================================================================\n0003    #  <startTime>2021-07-06T08:00:00Z</startTime>\n0004    #  <stopTime>2021-07-15T10:00:00Z</stopTime>\n0005    #  << XDOR:XDOR_BJXR_C%%%_CRCO_M&&&&&&_00001.BC >> 連続送信*****\n0006    #  << XOR:XOR__BJXR_C%%%_CRCO_M&&&&&&_00001.BC >> *****\n0007    # ==========================================================================\n0008    # ==========================================================================\n0009  . #  EXEC_AT 2021-07-06 08:00:00\n0010    # ◆◇◆◇◆◇◆◇◆◇◆◇◆◇◆◇◆◇◆◇◆◇◆◇◆◇◆◇◆◇◆◇◆◇◆◇◆\n0015    # ==========================================================================\n0016    # 0. MMO MOSIF Heater &  Switch to Standby Mode\n0017    # ==========================================================================\n0018    #\n0019    # Change MOSIF Heater Setting   (14sec)\n0020    # <forMPO>AJXF017A</forMPO>     \n0021    WAIT_SEC             42600             \n0022    #\n0023    # MMO Switch to Standby Mode (main) (300sec)\n0024    # <forMPO>AJXF001A</forMPO> \n0025    WAIT_SEC             360                   \n0026    #\n0027    # MMO Set HK rate to 64 second  (3sec)\n0028    # <forMPO>AJXF005A</forMPO> \n0029    WAIT_SEC              240                  \n0030    #"]
["main_end(XDOR)","0122    # ==========================================================================\n0123    # 99. MMO Dormant Mode\n0124    # ==========================================================================\n0125    WAIT_SEC             240                   \n0126    #\n0127    # MMO Set HK rate to 1 second   (3sec)\n0128    # <forMPO>AJXF004A</forMPO>\n0129    WAIT_SEC             117                 \n0130    #\n0131    # MMO Switch to Dormant Mode  (70sec)\n0132    # <forMPO>AJXF002A</forMPO>\n0133    WAIT_SEC             230                   \n0134    #\n0135    # Return MOSIF heater setting   (14sec)\n0136    # <forMPO>AJXF017B</forMPO>                   \n0291    #############################################################################"]
["main_end(XOR)","0122    # ==========================================================================\n0123    # 99. MMO Dormant Mode\n0124    # ==========================================================================\n0125    WAIT_SEC             240                   \n0126    #\n0127    # MMO Set HK rate to 1 second   (3sec)\n0128    # <forMPO>AJXF004A</forMPO>\n0129    WAIT_SEC             120                 \n0130    #\n0131    # MMO Switch to Dormant Mode  (70sec)\n0132    # <forMPO>AJXF002A</forMPO>\n0133    WAIT_SEC             300                   \n0134    #\n0135    # Return MOSIF heater setting   (14sec)\n0136    # <forMPO>AJXF017B</forMPO>                   \n0291    #############################################################################"]

{"sheet":"List","index":8,"n_rows":106,"n_cols":7,"rows_kept":106,"cut":false,"hidden":false,"merged":[[42,0,43,0],[1,0,9,0],[10,0,27,0],[28,0,32,0],[33,0,37,0],[38,0,41,0],[88,0,90,0],[92,0,94,0],[96,0,97,0],[100,0,105,0],[44,0,47,0],[48,0,59,0],[60,0,61,0],[62,0,72,0],[73,0,85,0],[86,0,87,0]]}
[null,null,"Duration (sec)","source filename","filename ",null,"cmdcount"]
["BUS","BUS_CEL_MONI_OFF",40,null,"dcsm-BUS_CEL_MONI_OFF",null,1]
[null,"BUS_CEL_MONI_ON",40,null,"dcsm-BUS_CEL_MONI_ON",null,1]
[null,"BUS_CHG_BEFORE_CHK",0,null,"dcsm-BUS_CHG_BEFORE_CHK",null,0]
[null,"BUS_CHG_EMERGENCY_OFF",86,null,"dcsm-BUS_CHG_Emergency_OFF",null,5]
[null,"BUS_CHG_SET",298,null,"dcsm-BUS_CHG_SET",null,14]
[null,"BUS_CHG_START",82,null,"dcsm-BUS_CHG_START",null,2]
[null,"BUS_CHG_STOP_BAT-EXT",160,null,"dcsm-BUS_CHG_STOP_BAT-EXT",null,4]
[null,"BUS_MMO_OFF",140,null,"dcsm-BUS_MMO_OFF",null,1]
[null,"BUS_MMO_ON",80,null,"dcsm-BUS_MMO_ON",null,2]
["CRCO","CRCO_BUS_MONI_ON",310,null,"dcsm-CRCO_BUS_MONI_ON",null,10]
[null,"CRCO_CEL_MONI_OFF",40,null,"dcsm-CRCO_CEL_MONI_OFF",null,1]
[null,"CRCO_ENA",1134,null,"dcsm-CRCO_ENA_CHECK",null,18]
[null,"CRCO_HEPE",2206,null,"dcsm-CRCO_HEPE_CHECK",null,36]
[null,"CRCO_HEPI",2730,null,"dcsm-CRCO_HEPI_CHECK",null,48]
[null,"CRCO_MASTWPT",1848,null,"dcsm-CRCO_MASTWPT_CHECK",null,41]
[null,"CRCO_MDM",2332,null,"dcsm-CRCO_MDM_CHECK",null,45]
[null,"CRCO_MDP_OFF",120,null,"dcsm-CRCO_MDP_OFF",null,4]
[null,"CRCO_MDP_ON",509,null,"dcsm-CRCO_MDP_ON",null,12]
[null,"CRCO_MEA",4620,null,"dcsm-CRCO_MEA_CHECK",null,52]
[null,"CRCO_MGF",3969,null,"dcsm-CRCO_MGF_CHECK",null,49]
[null,"CRCO_MIA_C",1892,null,"dcsm-CRCO_MIA_CHECK_C",null,20]
[null,"CRCO_MSASI",6688,null,"dcsm-CRCO_MSASI_CHECK",null,23]
[null,"CRCO_MSA_C",1102,null,"dcsm-CRCO_MSA_CHECK_C",null,19]
[null,"CRCO_PME_OFF",120,null,"dcsm-CRCO_PME_OFF",null,5]
[null,"CRCO_PME_ON",160,null,"dcsm-CRCO_PME_ON",null,5]
[null,"CRCO_PWI",2448,null,"dcsm-CRCO_PWI_CHECK",null,51]
[null,"CRCO_SI_READY",377,null,"dcsm-CRCO_SI_READY",null,17]
["BUS","BUS_OFF_D",220,null,"dcsm-EF_BUS_MONI_OFF",null,5]
[null,"BUS_SETUP_D",577,null,"dcsm-EF_BUS_MONI_ON",null,20]
[null,"TLM_MODE_10",42,null,"dcsm-EF_BUS_TLM_MODE_10",null,2]
[null,"TLM_MODE_5",42,null,"dcsm-EF_BUS_TLM_MODE_5",null,2]
[null,"TLM_MODE_7",2,null,"dcsm-EF_BUS_TLM_MODE_7",null,1]
["ENA","ENA_HV_OFF",198,null,"dcsm-EF_ENA_HV_OFF",null,4]
[null,"ENA_HV_ON",344,null,"dcsm-EF_ENA_HV_ON",null,18]
[null,"ENA_HV_ON_H",344,null,"dcsm-EF_ENA_HV_ON_H",null,18]
[null,"ENA_OFF",88,null,"dcsm-EF_ENA_power_OFF",null,4]
[null,"ENA_ON_SETUP",564,null,"dcsm-EF_ENA_power_ON",null,7]
["HEP","HEP_HV_OFF",190,null,"dcsm-EF_HEPE_HV_OFF_OBS_OFF",null,5]
[null,"HEP_HV_ON",270,null,"dcsm-EF_HEPE_HV_ON_OBS_START",null,6]
[null,"HEP_OFF",70,null,"dcsm-EF_HEPE_OFF_STOP",null,4]
[null,"HEP_ON_SETUP",1230,null,"dcsm-EF_HEP_ON_START_for_TL",null,34]
["MDM","MDM_OFF",160,null,"dcsm-EF_MDM_OFF",null,4]
[null,"MDM_ON_SETUP",202,null,"dcsm-EF_MDM_ON",null,6]
["MDP","MDP_CRUISE_SET",42,null,"dcsm-EF_MDP_CRUISE_SET",null,2]
[null,"MDP_ERR_DUMP",9080,null,"dcsm-EF_MDP_ERR_DUMP",null,6]
[null,"MDP_ON_D",509,null,"dcsm-EF_MDP_ON",null,11]
[null,"MDP_OFF_D",120,null,"dcsm-EF_MDP_POWEROFF",null,3]
["MEA","MEA1_HV_OFF",182,null,"dcsm-EF_MEA1_HV_OFF",null,10]
[null,"MEA1_HV_ON",1702,null,"dcsm-EF_MEA1_HV_ON",null,27]
[null,"MEA1_HV_SCAN_OFF",186,null,"dcsm-EF_MEA1_HV_SCAN_OFF",null,12]
[null,"MEA1_OFF",160,null,"dcsm-EF_MEA1_OFF",null,4]
[null,"MEA1_ON_SETUP_SW",292,null,"dcsm-EF_MEA1_ON_SW",null,12]
[null,"MEA_HV_OFF",202,null,"dcsm-EF_MEA_HV_OFF",null,20]
[null,"MEA_HV_ON",1756,null,"dcsm-EF_MEA_HV_ON",null,54]
[null,"MEA_HV_ON_MOD",126,null,"dcsm-EF_MEA_HV_ON_modified",null,6]
[null,"MEA_HV_SCAN_OFF",210,null,"dcsm-EF_MEA_HV_SCAN_OFF",null,24]
[null,"MEA_OFF",164,null,"dcsm-EF_MEA_OFF",null,6]
[null,"MEA_ON_SETUP_MAG",386,null,"dcsm-EF_MEA_ON_MAG",null,21]
[null,"MEA_ON_SETUP_SW",386,null,"dcsm-EF_MEA_ON_SW",null,21]
["MGF","MGF_OFF",8,null,"dcsm-EF_MGF_OFF",null,1]
[null,"MGF_ON_SETUP",14,null,"dcsm-EF_MGF_ON",null,3]
["MIA","MIA_HV_OFF",60,null,"dcsm-EF_MIA_HV_OFF",null,1]
[null,"MIA_HV_ON",240,null,"dcsm-EF_MIA_HV_ON",null,6]
[null,"MIA_HV_ON_MAG",142,null,"dcsm-EF_MIA_HV_ON_MAG",null,4]
[null,"MIA_HV_ON_MAG_RC",262,null,"dcsm-EF_MIA_HV_ON_MAG_RC",null,7]
[null,"MIA_HV_ON_RC",280,null,"dcsm-EF_MIA_HV_ON_RC",null,7]
[null,"MIA_HV_ON_SW",102,null,"dcsm-EF_MIA_HV_ON_SW",null,3]
[null,"MIA_HV_ON_SW_RC",262,null,"dcsm-EF_MIA_HV_ON_SW_RC",null,7]
[null,"MIA_OFF",160,null,"dcsm-EF_MIA_OFF",null,4]
[null,"MIA_ON_SETUP",382,null,"dcsm-EF_MIA_ON",null,6]
[null,"MIA_ON_ASIC_LDET",582,null,"dcsm-EF_MIA_ON_ASIC_LDET",null,11]
[null,"MIA_ON_C",0,null,"dcsm-EF_MIA_ON_C",null,0]
["MSA","MSA_HV_OFF",714,null,"dcsm-EF_MSA_HV_OFF",null,24]
[null,"MSA_HV_OFF_VFB",774,null,"dcsm-EF_MSA_HV_OFF_VFB",null,25]
[null,"MSA_HV_ON_1",4692,null,"dcsm-EF_MSA_HV_ON_1",null,108]
[null,"MSA_HV_ON_1_MFB_SF",1573,null,"dcsm-EF_MSA_HV_ON_1_MFB_Safe",null,108]
[null,"MSA_HV_ON_VFB1",2882,null,"dcsm-EF_MSA_HV_ON_1_VFB",null,108]
[null,"MSA_HV_ON_2",6262,null,"dcsm-EF_MSA_HV_ON_2",null,124]
[null,"MSA_HV_ON_2_MFB_SF",1860,null,"dcsm-EF_MSA_HV_ON_2_MFB_Safe",null,124]
[null,"MSA_HV_ON_VFB2",3262,null,"dcsm-EF_MSA_HV_ON_2_VFB",null,124]
[null,"MSA_OFF",380,null,"dcsm-EF_MSA_OFF",null,25]
[null,"MSA_ON_SETUP",1092,null,"dcsm-EF_MSA_ON",null,15]
[null,"MSA_ON_SETUP_C",1092,null,"dcsm-EF_MSA_ON_C",null,15]
[null,"MSA_SOFT_RESET",120,null,"dcsm-EF_MSA_SOFT_RESET",null,3]
[null,"MSA_SOFT_RESET2",100,null,"dcsm-EF_MSA_SOFT_RESET2",null,5]
["PME","PME_OFF",40,null,"dcsm-EF_PME_OFF",null,1]
[null,"PME_ON",80,null,"dcsm-EF_PME_ON",null,2]
["PWI","PWI_OFF",80,null,"dcsm-EF_PWI_OFF",null,2]
[null,"PWI_ON",828,null,"dcsm-EF_PWI_ON",null,26]
[null,"PWI_ON_SETUP",868,null,"dcsm-EF_PWI_ON_CRUISE",null,27]
["MACRO","MC_ENA",246,null,"dcsm-MC_ENA_MDP",null,21]
["MDP","MDP_AP9_DUMP",1880,null,"dcsm-MDP_AP09_LOG_DUMP",null,4]
[null,"MDP_ERR_LOG_DUMP",9080,null,"dcsm-MDP_ERR_LOG_DUMP",null,6]
[null,"MDP_HK_REPEINT_6",42,null,"dcsm-MDP_HK_REPINT_6",null,2]
["MEA","MEA2_MEM_DMP",2550,null,"dcsm-MEA2_MEM_DMP",null,36]
["MSASI","MSASI_DARK_1",768,null,"dcsm-MSASI_dark_CO_sequence1",null,11]
[null,"MSASI_DARK_2",19498,null,"dcsm-MSASI_dark_CO_sequence2",null,55]
["MSA","MSA_TABLE_UPLOAD",0,null,"dcsm-MSA_TABLE_UPLOAD",null,0]
["TCFS","TCSF_MSASI",345,null,"dcsm-tcfs_tbl1_msasi_set",null,13]
["WAIT","WAIT3600",3600]
[null,"WAIT3500",3500]
[null,"WAIT19357",19357]
[null,"WAIT1800",1800,null,"WAIT_SEC 1800"]
[null,"WAIT10800",10800,null,"WAIT_SEC 10800"]
[null,"WAIT600",600,null,"WAIT_SEC 600"]

{"sheet":"WOL","index":9,"n_rows":23,"n_cols":5,"rows_kept":23,"cut":false,"hidden":false,"merged":[]}
[null,null,"START　TIME","2022-03-17T05:00:00"]
[null,null,"END　TIME","2022-03-26T23:20:00"]
[null,"ID",null,"date time excel","duration(s)"]
[null,"WOLS","WOL#1","2022-03-18T02:26:56",1200]
[null,"WOLS","WOL#2","2022-03-18T21:35:20",1200]
[null,"WOLS","WOL#3","2022-03-19T20:16:25",1200]
[null,"WOLS","WOL#4","2022-03-20T20:30:43",1200]
[null,"WOLS","WOL#5","2022-03-21T22:10:35",1200]
[null,"WOLS","WOL#6","2022-03-23T01:51:05",1200]
[null,"WOLS","WOL#7","2022-03-24T10:36:36",1200]
[null,"WOLS","WOL#8","2022-03-25T23:06:54",1200]
[]
[null,"WOLS","WOL#9","2022-03-26T23:24:55",1200]
[null,"WOLS","WOL#10","2022-03-27T19:46:14",1200]
[null,"WOLS","WOL#11","2022-03-28T20:40:09",1200]
[null,"WOLS","WOL#12","2022-03-30T01:51:05",1200]
[null,"WOLS","WOL#13","2022-03-31T10:19:54",1200]
[null,"WOLS","WOL#14","2022-04-01T18:53:54",1200]
[null,"WOLS","WOL#15","2022-04-02T21:42:12",1200]
[null,"WOLS","WOL#16","2022-04-03T20:54:29",1200]
[null,"WOLS","WOL#17","2022-04-04T20:44:09",1200]
[null,"WOLS","WOL#18","2022-04-06T01:25:47",1200]
[null,"WOLS","WOL#19","2022-04-07T01:22:18",1200]

{"sheet":"obs_sequence","index":10,"n_rows":208,"n_cols":14,"rows_kept":208,"cut":false,"hidden":false,"merged":[[194,5,195,5],[199,5,200,5],[201,5,204,5],[109,5,111,5],[113,5,116,5],[120,5,122,5],[123,5,125,5],[130,5,131,5],[135,5,136,5],[138,5,139,5],[175,5,176,5],[178,5,179,5],[183,5,184,5],[186,5,187,5],[191,5,192,5],[98,5,100,5],[102,5,105,5],[162,5,163,5],[167,5,168,5],[170,5,171,5],[143,5,144,5],[146,5,147,5],[151,5,152,5],[154,5,155,5],[159,5,160,5],[76,5,77,5],[81,5,82,5],[83,5,86,5],[88,5,90,5],[91,5,94,5],[57,5,58,5],[60,5,61,5],[65,5,66,5],[68,5,69,5],[73,5,74,5],[36,5,37,5],[41,5,42,5],[44,5,45,5],[49,5,50,5],[52,5,53,5],[20,5,21,5],[25,5,26,5],[28,5,29,5],[33,5,34,5],[3,0,3,1],[3,2,3,3],[12,5,13,5],[17,5,18,5],[8,5,11,5]]}
["START",null,{"$f":"WOL!D1","v":"2022-03-17T05:00:00"},"OBCP START",{"$f":"C1","v":"2022-03-17T05:00:00"},null,null,null,null,null,null,"5days"]
["END",null,{"$f":"C208","v":"2022-04-07T23:50:00"},"OBCP END",{"$f":"C2+(240+120+300)/3600/24","v":"2022-04-08T00:01:00"},"CMD END",{"$f":"C2-100/3600/24","v":"2022-04-07T23:48:20"}]
[]
["Relative time (h)",null,"Absolute time (UTC)",null,null,null,null,null,null,null,"main2-CROUSE_OBS12_4_XDOR_001_M63.cps",{"$f":"+SUM(L6:L85)","v":544}]
["Start","End","Start","End","Event","Activity","Procedure","Duration (sec)",null,null,null,"cmd count","XOR Time","cmd count"]
[null,null,"2022-03-17T05:00:00",{"$f":"C6+H6/3600/24","v":"2022-03-17T05:08:29"},null,"MDP ON","MDP_ON_D",{"$f":"VLOOKUP(G6,List!B:C,2,0)","v":509},null,null,{"$f":"VLOOKUP(G6,List!B:E,4,0)","v":"dcsm-EF_MDP_ON"},{"$f":"VLOOKUP(G6,List!B:G,6,0)","v":11},{"$f":"C6-317/3600/24","v":"2022-03-17T04:54:43"},{"$f":"+\"0000    CALL \"&K6&\" -Run\"","v":"0000    CALL dcsm-EF_MDP_ON -Run"}]
[null,null,{"$f":"D6","v":"2022-03-17T05:08:29"},{"$f":"C7+H7/3600/24","v":"2022-03-17T05:09:11"},null,null,"MDP_CRUISE_SET",{"$f":"VLOOKUP(G7,List!B:C,2,0)","v":42},null,null,{"$f":"VLOOKUP(G7,List!B:E,4,0)","v":"dcsm-EF_MDP_CRUISE_SET"},{"$f":"VLOOKUP(G7,List!B:G,6,0)","v":2},"2022-03-17T05:03:12","0000    CALL dcsm-EF_MDP_CRUISE_SET -Run"]
[null,null,{"$f":"D7","v":"2022-03-17T05:09:11"},{"$f":"C8+H8/3600/24","v":"2022-03-17T05:09:53"},null,"TLM mode change (MODE_10)","TLM_MODE_10",{"$f":"VLOOKUP(G8,List!B:C,2,0)","v":42},null,null,{"$f":"VLOOKUP(G8,List!B:E,4,0)","v":"dcsm-EF_BUS_TLM_MODE_10"},{"$f":"VLOOKUP(G8,List!B:G,6,0)","v":2},"2022-03-17T05:03:54","0000    CALL dcsm-EF_BUS_TLM_MODE_10 -Run"]
[null,null,"2022-03-17T05:09:53","2022-03-17T05:14:45",null,"SI ON","MEA1_ON_SETUP_SW",{"$f":"VLOOKUP(G9,List!B:C,2,0)","v":292},null,null,{"$f":"VLOOKUP(G9,List!B:E,4,0)","v":"dcsm-EF_MEA1_ON_SW"},{"$f":"VLOOKUP(G9,List!B:G,6,0)","v":12},"2022-03-17T05:04:36","0000    CALL dcsm-EF_MEA1_ON_SW -Run"]
[null,null,"2022-03-17T05:14:45","2022-03-17T05:35:15",null,null,"HEP_ON_SETUP",{"$f":"VLOOKUP(G10,List!B:C,2,0)","v":1230},null,null,{"$f":"VLOOKUP(G10,List!B:E,4,0)","v":"dcsm-EF_HEP_ON_START_for_TL"},{"$f":"VLOOKUP(G10,List!B:G,6,0)","v":34},"2022-03-17T05:09:28","0000    CALL dcsm-EF_HEP_ON_START_for_TL -Run"]
[null,null,"2022-03-17T05:35:15","2022-03-17T05:36:35",null,null,"PME_ON",{"$f":"VLOOKUP(G11,List!B:C,2,0)","v":80},null,null,{"$f":"VLOOKUP(G11,List!B:E,4,0)","v":"dcsm-EF_PME_ON"},{"$f":"VLOOKUP(G11,List!B:G,6,0)","v":2},"2022-03-17T05:29:58","0000    CALL dcsm-EF_PME_ON -Run"]
[null,null,"2022-03-17T05:36:35","2022-03-17T05:36:49",null,null,"MGF_ON_SETUP",{"$f":"VLOOKUP(G12,List!B:C,2,0)","v":14},null,null,{"$f":"VLOOKUP(G12,List!B:E,4,0)","v":"dcsm-EF_MGF_ON"},{"$f":"VLOOKUP(G12,List!B:G,6,0)","v":3},"2022-03-17T05:31:18","0000    CALL dcsm-EF_MGF_ON -Run"]
[null,null,{"$f":"D12","v":"2022-03-17T05:36:49"},"2022-03-17T06:05:11",null,"SI HV ON","MEA1_HV_ON",{"$f":"VLOOKUP(G13,List!B:C,2,0)","v":1702},null,null,{"$f":"VLOOKUP(G13,List!B:E,4,0)","v":"dcsm-EF_MEA1_HV_ON"},{"$f":"VLOOKUP(G13,List!B:G,6,0)","v":27},"2022-03-17T05:31:32",{"$f":"+\"0000    CALL \"&K13&\" -Run\"","v":"0000    CALL dcsm-EF_MEA1_HV_ON -Run"}]
[null,null,{"$f":"D13","v":"2022-03-17T06:05:11"},"2022-03-17T06:09:41",null,null,"HEP_HV_ON",{"$f":"VLOOKUP(G14,List!B:C,2,0)","v":270},null,null,{"$f":"VLOOKUP(G14,List!B:E,4,0)","v":"dcsm-EF_HEPE_HV_ON_OBS_START"},{"$f":"VLOOKUP(G14,List!B:G,6,0)","v":6},"2022-03-17T05:59:54",{"$f":"+\"0000    CALL \"&K14&\" -Run\"","v":"0000    CALL dcsm-EF_HEPE_HV_ON_OBS_START -Run"}]
[null,null,"2022-03-17T06:09:41","2022-03-17T06:10:23",null,"TLM mode change (MODE_5)","TLM_MODE_5",{"$f":"VLOOKUP(G15,List!B:C,2,0)","v":42},null,null,{"$f":"VLOOKUP(G15,List!B:E,4,0)","v":"dcsm-EF_BUS_TLM_MODE_5"},{"$f":"VLOOKUP(G15,List!B:G,6,0)","v":2},"2022-03-17T06:04:24","0000    CALL dcsm-EF_BUS_TLM_MODE_5 -Run"]
[null,null,"2022-03-17T06:10:23",{"$f":"C17","v":"2022-03-18T02:20:02"},"Observation A",null,null,{"$f":"(D16-C16)*3600*24","v":72579.00000102818},{"$f":"H16/3600","v":20.160833333618939},null,null,0,"2022-03-17T06:05:06",{"$f":"\"0000    WAIT_SEC  \"&TEXT(H16,\"#0\")","v":"0000    WAIT_SEC  72579"}]
[null,null,{"$f":"D17-H17/3600/24","v":"2022-03-18T02:20:02"},{"$f":"C18","v":"2022-03-18T02:20:44"},null,"TLM mode change (MODE_10)","TLM_MODE_10",{"$f":"VLOOKUP(G17,List!B:C,2,0)","v":42},null,null,{"$f":"VLOOKUP(G17,List!B:E,4,0)","v":"dcsm-EF_BUS_TLM_MODE_10"},{"$f":"VLOOKUP(G17,List!B:G,6,0)","v":2},"2022-03-18T02:14:45",{"$f":"+\"0000    CALL \"&K17&\" -Run\"","v":"0000    CALL dcsm-EF_BUS_TLM_MODE_10 -Run"}]
[null,null,{"$f":"D18-H18/3600/24","v":"2022-03-18T02:20:44"},{"$f":"C19","v":"2022-03-18T02:23:54"},null,"SI HV OFF","HEP_HV_OFF",{"$f":"VLOOKUP(G18,List!B:C,2,0)","v":190},null,null,{"$f":"VLOOKUP(G18,List!B:E,4,0)","v":"dcsm-EF_HEPE_HV_OFF_OBS_OFF"},{"$f":"VLOOKUP(G18,List!B:G,6,0)","v":5},"2022-03-18T02:15:27","0000    CALL dcsm-EF_HEPE_HV_OFF_OBS_OFF -Run"]
[null,null,{"$f":"D19-H19/3600/24","v":"2022-03-18T02:23:54"},{"$f":"C20","v":"2022-03-18T02:26:56"},null,null,"MEA1_HV_OFF",{"$f":"VLOOKUP(G19,List!B:C,2,0)","v":182},null,null,{"$f":"VLOOKUP(G19,List!B:E,4,0)","v":"dcsm-EF_MEA1_HV_OFF"},{"$f":"VLOOKUP(G19,List!B:G,6,0)","v":10},"2022-03-18T02:18:37","0000    CALL dcsm-EF_MEA1_HV_OFF -Run"]
[null,null,"2022-03-18T02:26:56",{"$f":"C20+H20/3600/24","v":"2022-03-18T02:46:56"},"WOL#1",null,{"$f":"(C21-D19)*24*3600","v":1800.0000002095476},1200,null,null,null,0,"2022-03-18T02:21:39",{"$f":"\"0000    WAIT_SEC  \"&TEXT(G20,\"#0\")","v":"0000    WAIT_SEC  1800"}]
[null,null,{"$f":"D20+10/60/24","v":"2022-03-18T02:56:56"},{"$f":"C21+H21/3600/24","v":"2022-03-18T03:25:18"},null,"SI HV ON","MEA1_HV_ON",{"$f":"VLOOKUP(G21,List!B:C,2,0)","v":1702},null,null,{"$f":"VLOOKUP(G21,List!B:E,4,0)","v":"dcsm-EF_MEA1_HV_ON"},{"$f":"VLOOKUP(G21,List!B:G,6,0)","v":27},"2022-03-18T02:51:39",{"$f":"+\"0000    CALL \"&K21&\" -Run\"","v":"0000    CALL dcsm-EF_MEA1_HV_ON -Run"}]
[null,null,{"$f":"D21","v":"2022-03-18T03:25:18"},"2022-03-18T03:29:48",null,null,"HEP_HV_ON",{"$f":"VLOOKUP(G22,List!B:C,2,0)","v":270},null,null,{"$f":"VLOOKUP(G22,List!B:E,4,0)","v":"dcsm-EF_HEPE_HV_ON_OBS_START"},{"$f":"VLOOKUP(G22,List!B:G,6,0)","v":6},"2022-03-18T03:20:01",{"$f":"+\"0000    CALL \"&K22&\" -Run\"","v":"0000    CALL dcsm-EF_HEPE_HV_ON_OBS_START -Run"}]
[null,null,"2022-03-18T03:29:48","2022-03-18T03:30:30",null,"TLM mode change (MODE_5)","TLM_MODE_5",{"$f":"VLOOKUP(G23,List!B:C,2,0)","v":42},null,null,{"$f":"VLOOKUP(G23,List!B:E,4,0)","v":"dcsm-EF_BUS_TLM_MODE_5"},{"$f":"VLOOKUP(G23,List!B:G,6,0)","v":2},"2022-03-18T03:24:31","0000    CALL dcsm-EF_BUS_TLM_MODE_5 -Run"]
[null,null,"2022-03-18T03:30:30",{"$f":"C25","v":"2022-03-18T21:28:26"},"Observation B",null,null,{"$f":"(D24-C24)*3600*24","v":64676.000000559725},{"$f":"H24/3600","v":17.965555555711035},null,null,0,"2022-03-18T03:25:13",{"$f":"\"0000    WAIT_SEC  \"&TEXT(H24,\"#0\")","v":"0000    WAIT_SEC  64676"}]
[null,null,{"$f":"D25-H25/3600/24","v":"2022-03-18T21:28:26"},{"$f":"C26","v":"2022-03-18T21:29:08"},null,"TLM mode change (MODE_10)","TLM_MODE_10",{"$f":"VLOOKUP(G25,List!B:C,2,0)","v":42},null,null,{"$f":"VLOOKUP(G25,List!B:E,4,0)","v":"dcsm-EF_BUS_TLM_MODE_10"},{"$f":"VLOOKUP(G25,List!B:G,6,0)","v":2},"2022-03-18T21:23:09",{"$f":"+\"0000    CALL \"&K25&\" -Run\"","v":"0000    CALL dcsm-EF_BUS_TLM_MODE_10 -Run"}]
[null,null,{"$f":"D26-H26/3600/24","v":"2022-03-18T21:29:08"},{"$f":"C27","v":"2022-03-18T21:32:18"},null,"SI HV OFF","HEP_HV_OFF",{"$f":"VLOOKUP(G26,List!B:C,2,0)","v":190},null,null,{"$f":"VLOOKUP(G26,List!B:E,4,0)","v":"dcsm-EF_HEPE_HV_OFF_OBS_OFF"},{"$f":"VLOOKUP(G26,List!B:G,6,0)","v":5},"2022-03-18T21:23:51","0000    CALL dcsm-EF_HEPE_HV_OFF_OBS_OFF -Run"]
[null,null,{"$f":"D27-H27/3600/24","v":"2022-03-18T21:32:18"},{"$f":"C28","v":"2022-03-18T21:35:20"},null,null,"MEA1_HV_OFF",{"$f":"VLOOKUP(G27,List!B:C,2,0)","v":182},null,null,{"$f":"VLOOKUP(G27,List!B:E,4,0)","v":"dcsm-EF_MEA1_HV_OFF"},{"$f":"VLOOKUP(G27,List!B:G,6,0)","v":10},"2022-03-18T21:27:01","0000    CALL dcsm-EF_MEA1_HV_OFF -Run"]
[null,null,"2022-03-18T21:35:20",{"$f":"C28+H28/3600/24","v":"2022-03-18T21:55:20"},"WOL#2",null,{"$f":"(C29-D27)*24*3600","v":1800.0000002095476},1200,null,null,null,0,"2022-03-18T21:30:03",{"$f":"\"0000    WAIT_SEC  \"&TEXT(G28,\"#0\")","v":"0000    WAIT_SEC  1800"}]
[null,null,{"$f":"D28+10/60/24","v":"2022-03-18T22:05:20"},{"$f":"C29+H29/3600/24","v":"2022-03-18T22:33:42"},null,"SI HV ON","MEA1_HV_ON",{"$f":"VLOOKUP(G29,List!B:C,2,0)","v":1702},null,null,{"$f":"VLOOKUP(G29,List!B:E,4,0)","v":"dcsm-EF_MEA1_HV_ON"},{"$f":"VLOOKUP(G29,List!B:G,6,0)","v":27},"2022-03-18T22:00:03",{"$f":"+\"0000    CALL \"&K29&\" -Run\"","v":"0000    CALL dcsm-EF_MEA1_HV_ON -Run"}]
[null,null,{"$f":"D29","v":"2022-03-18T22:33:42"},"2022-03-18T22:38:12",null,null,"HEP_HV_ON",{"$f":"VLOOKUP(G30,List!B:C,2,0)","v":270},null,null,{"$f":"VLOOKUP(G30,List!B:E,4,0)","v":"dcsm-EF_HEPE_HV_ON_OBS_START"},{"$f":"VLOOKUP(G30,List!B:G,6,0)","v":6},"2022-03-18T22:28:25",{"$f":"+\"0000    CALL \"&K30&\" -Run\"","v":"0000    CALL dcsm-EF_HEPE_HV_ON_OBS_START -Run"}]
[null,null,"2022-03-18T22:38:12","2022-03-18T22:38:54",null,"TLM mode change (MODE_5)","TLM_MODE_5",{"$f":"VLOOKUP(G31,List!B:C,2,0)","v":42},null,null,{"$f":"VLOOKUP(G31,List!B:E,4,0)","v":"dcsm-EF_BUS_TLM_MODE_5"},{"$f":"VLOOKUP(G31,List!B:G,6,0)","v":2},"2022-03-18T22:32:55","0000    CALL dcsm-EF_BUS_TLM_MODE_5 -Run"]
[null,null,"2022-03-18T22:38:54",{"$f":"C33","v":"2022-03-19T20:09:31"},"Observation C",null,null,{"$f":"(D32-C32)*3600*24","v":77437.000000057742},{"$f":"H32/3600","v":21.510277777793817},null,null,0,"2022-03-18T22:33:37",{"$f":"\"0000    WAIT_SEC  \"&TEXT(H32,\"#0\")","v":"0000    WAIT_SEC  77437"}]
[null,null,{"$f":"D33-H33/3600/24","v":"2022-03-19T20:09:31"},{"$f":"C34","v":"2022-03-19T20:10:13"},null,"TLM mode change (MODE_10)","TLM_MODE_10",{"$f":"VLOOKUP(G33,List!B:C,2,0)","v":42},null,null,{"$f":"VLOOKUP(G33,List!B:E,4,0)","v":"dcsm-EF_BUS_TLM_MODE_10"},{"$f":"VLOOKUP(G33,List!B:G,6,0)","v":2},"2022-03-19T20:04:14",{"$f":"+\"0000    CALL \"&K33&\" -Run\"","v":"0000    CALL dcsm-EF_BUS_TLM_MODE_10 -Run"}]
[null,null,{"$f":"D34-H34/3600/24","v":"2022-03-19T20:10:13"},{"$f":"C35","v":"2022-03-19T20:13:23"},null,"SI HV OFF","HEP_HV_OFF",{"$f":"VLOOKUP(G34,List!B:C,2,0)","v":190},null,null,{"$f":"VLOOKUP(G34,List!B:E,4,0)","v":"dcsm-EF_HEPE_HV_OFF_OBS_OFF"},{"$f":"VLOOKUP(G34,List!B:G,6,0)","v":5},"2022-03-19T20:04:56","0000    CALL dcsm-EF_HEPE_HV_OFF_OBS_OFF -Run"]
[null,null,{"$f":"D35-H35/3600/24","v":"2022-03-19T20:13:23"},{"$f":"C36","v":"2022-03-19T20:16:25"},null,null,"MEA1_HV_OFF",{"$f":"VLOOKUP(G35,List!B:C,2,0)","v":182},null,null,{"$f":"VLOOKUP(G35,List!B:E,4,0)","v":"dcsm-EF_MEA1_HV_OFF"},{"$f":"VLOOKUP(G35,List!B:G,6,0)","v":10},"2022-03-19T20:08:06","0000    CALL dcsm-EF_MEA1_HV_OFF -Run"]
[null,null,"2022-03-19T20:16:25",{"$f":"C36+H36/3600/24","v":"2022-03-19T20:36:25"},"WOL#3",null,{"$f":"(C37-D35)*24*3600","v":1800.0000002095476},1200,null,null,null,0,"2022-03-19T20:11:08",{"$f":"\"0000    WAIT_SEC  \"&TEXT(G36,\"#0\")","v":"0000    WAIT_SEC  1800"}]
[null,null,{"$f":"D36+10/60/24","v":"2022-03-19T20:46:25"},{"$f":"C37+H37/3600/24","v":"2022-03-19T21:14:47"},null,"SI HV ON","MEA1_HV_ON",{"$f":"VLOOKUP(G37,List!B:C,2,0)","v":1702},null,null,{"$f":"VLOOKUP(G37,List!B:E,4,0)","v":"dcsm-EF_MEA1_HV_ON"},{"$f":"VLOOKUP(G37,List!B:G,6,0)","v":27},"2022-03-19T20:41:08",{"$f":"+\"0000    CALL \"&K37&\" -Run\"","v":"0000    CALL dcsm-EF_MEA1_HV_ON -Run"}]
[null,null,{"$f":"D37","v":"2022-03-19T21:14:47"},"2022-03-19T21:19:17",null,null,"HEP_HV_ON",{"$f":"VLOOKUP(G38,List!B:C,2,0)","v":270},null,null,{"$f":"VLOOKUP(G38,List!B:E,4,0)","v":"dcsm-EF_HEPE_HV_ON_OBS_START"},{"$f":"VLOOKUP(G38,List!B:G,6,0)","v":6},"2022-03-19T21:09:30",{"$f":"+\"0000    CALL \"&K38&\" -Run\"","v":"0000    CALL dcsm-EF_HEPE_HV_ON_OBS_START -Run"}]
[null,null,"2022-03-19T21:19:17","2022-03-19T21:19:59",null,"TLM mode change (MODE_5)","TLM_MODE_5",{"$f":"VLOOKUP(G39,List!B:C,2,0)","v":42},null,null,{"$f":"VLOOKUP(G39,List!B:E,4,0)","v":"dcsm-EF_BUS_TLM_MODE_5"},{"$f":"VLOOKUP(G39,List!B:G,6,0)","v":2},"2022-03-19T21:14:00","0000    CALL dcsm-EF_BUS_TLM_MODE_5 -Run"]
[null,null,"2022-03-19T21:19:59",{"$f":"C41","v":"2022-03-20T20:23:49"},"Observation D",null,null,{"$f":"(D40-C40)*3600*24","v":83030.000000540167},{"$f":"H40/3600","v":23.063888889038935},null,null,0,"2022-03-19T21:14:42",{"$f":"\"0000    WAIT_SEC  \"&TEXT(H40,\"#0\")","v":"0000    WAIT_SEC  83030"}]
[null,null,{"$f":"D41-H41/3600/24","v":"2022-03-20T20:23:49"},{"$f":"C42","v":"2022-03-20T20:24:31"},null,"TLM mode change (MODE_10)","TLM_MODE_10",{"$f":"VLOOKUP(G41,List!B:C,2,0)","v":42},null,null,{"$f":"VLOOKUP(G41,List!B:E,4,0)","v":"dcsm-EF_BUS_TLM_MODE_10"},{"$f":"VLOOKUP(G41,List!B:G,6,0)","v":2},"2022-03-20T20:18:32",{"$f":"+\"0000    CALL \"&K41&\" -Run\"","v":"0000    CALL dcsm-EF_BUS_TLM_MODE_10 -Run"}]
[null,null,{"$f":"D42-H42/3600/24","v":"2022-03-20T20:24:31"},{"$f":"C43","v":"2022-03-20T20:27:41"},null,"SI HV OFF","HEP_HV_OFF",{"$f":"VLOOKUP(G42,List!B:C,2,0)","v":190},null,null,{"$f":"VLOOKUP(G42,List!B:E,4,0)","v":"dcsm-EF_HEPE_HV_OFF_OBS_OFF"},{"$f":"VLOOKUP(G42,List!B:G,6,0)","v":5},"2022-03-20T20:19:14","0000    CALL dcsm-EF_HEPE_HV_OFF_OBS_OFF -Run"]
[null,null,{"$f":"D43-H43/3600/24","v":"2022-03-20T20:27:41"},{"$f":"C44","v":"2022-03-20T20:30:43"},null,null,"MEA1_HV_OFF",{"$f":"VLOOKUP(G43,List!B:C,2,0)","v":182},null,null,{"$f":"VLOOKUP(G43,List!B:E,4,0)","v":"dcsm-EF_MEA1_HV_OFF"},{"$f":"VLOOKUP(G43,List!B:G,6,0)","v":10},"2022-03-20T20:22:24","0000    CALL dcsm-EF_MEA1_HV_OFF -Run"]
[null,null,"2022-03-20T20:30:43",{"$f":"C44+H44/3600/24","v":"2022-03-20T20:50:43"},"WOL#4",null,{"$f":"(C45-D43)*24*3600","v":1800.0000002095476},1200,null,null,null,0,"2022-03-20T20:25:26",{"$f":"\"0000    WAIT_SEC  \"&TEXT(G44,\"#0\")","v":"0000    WAIT_SEC  1800"}]
[null,null,{"$f":"D44+10/60/24","v":"2022-03-20T21:00:43"},{"$f":"C45+H45/3600/24","v":"2022-03-20T21:29:05"},null,"SI HV ON","MEA1_HV_ON",{"$f":"VLOOKUP(G45,List!B:C,2,0)","v":1702},null,null,{"$f":"VLOOKUP(G45,List!B:E,4,0)","v":"dcsm-EF_MEA1_HV_ON"},{"$f":"VLOOKUP(G45,List!B:G,6,0)","v":27},"2022-03-20T20:55:26",{"$f":"+\"0000    CALL \"&K45&\" -Run\"","v":"0000    CALL dcsm-EF_MEA1_HV_ON -Run"}]
[null,null,{"$f":"D45","v":"2022-03-20T21:29:05"},"2022-03-20T21:33:35",null,null,"HEP_HV_ON",{"$f":"VLOOKUP(G46,List!B:C,2,0)","v":270},null,null,{"$f":"VLOOKUP(G46,List!B:E,4,0)","v":"dcsm-EF_HEPE_HV_ON_OBS_START"},{"$f":"VLOOKUP(G46,List!B:G,6,0)","v":6},"2022-03-20T21:23:48",{"$f":"+\"0000    CALL \"&K46&\" -Run\"","v":"0000    CALL dcsm-EF_HEPE_HV_ON_OBS_START -Run"}]
[null,null,"2022-03-20T21:33:35","2022-03-20T21:34:17",null,"TLM mode change (MODE_5)","TLM_MODE_5",{"$f":"VLOOKUP(G47,List!B:C,2,0)","v":42},null,null,{"$f":"VLOOKUP(G47,List!B:E,4,0)","v":"dcsm-EF_BUS_TLM_MODE_5"},{"$f":"VLOOKUP(G47,List!B:G,6,0)","v":2},"2022-03-20T21:28:18","0000    CALL dcsm-EF_BUS_TLM_MODE_5 -Run"]
[null,null,"2022-03-20T21:34:17",{"$f":"C49","v":"2022-03-21T22:03:41"},"Observation E",null,null,{"$f":"(D48-C48)*3600*24","v":88164.000000595115},{"$f":"H48/3600","v":24.49000000016531},null,null,0,"2022-03-20T21:29:00",{"$f":"\"0000    WAIT_SEC  \"&TEXT(H48,\"#0\")","v":"0000    WAIT_SEC  88164"}]
[null,null,{"$f":"D49-H49/3600/24","v":"2022-03-21T22:03:41"},{"$f":"C50","v":"2022-03-21T22:04:23"},null,"TLM mode change (MODE_10)","TLM_MODE_10",{"$f":"VLOOKUP(G49,List!B:C,2,0)","v":42},null,null,{"$f":"VLOOKUP(G49,List!B:E,4,0)","v":"dcsm-EF_BUS_TLM_MODE_10"},{"$f":"VLOOKUP(G49,List!B:G,6,0)","v":2},"2022-03-21T21:58:24",{"$f":"+\"0000    CALL \"&K49&\" -Run\"","v":"0000    CALL dcsm-EF_BUS_TLM_MODE_10 -Run"}]
[null,null,{"$f":"D50-H50/3600/24","v":"2022-03-21T22:04:23"},{"$f":"C51","v":"2022-03-21T22:07:33"},null,"SI HV OFF","HEP_HV_OFF",{"$f":"VLOOKUP(G50,List!B:C,2,0)","v":190},null,null,{"$f":"VLOOKUP(G50,List!B:E,4,0)","v":"dcsm-EF_HEPE_HV_OFF_OBS_OFF"},{"$f":"VLOOKUP(G50,List!B:G,6,0)","v":5},"2022-03-21T21:59:06","0000    CALL dcsm-EF_HEPE_HV_OFF_OBS_OFF -Run"]
[null,null,{"$f":"D51-H51/3600/24","v":"2022-03-21T22:07:33"},{"$f":"C52","v":"2022-03-21T22:10:35"},null,null,"MEA1_HV_OFF",{"$f":"VLOOKUP(G51,List!B:C,2,0)","v":182},null,null,{"$f":"VLOOKUP(G51,List!B:E,4,0)","v":"dcsm-EF_MEA1_HV_OFF"},{"$f":"VLOOKUP(G51,List!B:G,6,0)","v":10},"2022-03-21T22:02:16","0000    CALL dcsm-EF_MEA1_HV_OFF -Run"]
[null,null,"2022-03-21T22:10:35",{"$f":"C52+H52/3600/24","v":"2022-03-21T22:30:35"},"WOL#5",null,{"$f":"(C53-D51)*24*3600","v":1800.0000002095476},1200,null,null,null,0,"2022-03-21T22:05:18",{"$f":"\"0000    WAIT_SEC  \"&TEXT(G52,\"#0\")","v":"0000    WAIT_SEC  1800"}]
[null,null,{"$f":"D52+10/60/24","v":"2022-03-21T22:40:35"},{"$f":"C53+H53/3600/24","v":"2022-03-21T23:08:57"},null,"SI HV ON","MEA1_HV_ON",{"$f":"VLOOKUP(G53,List!B:C,2,0)","v":1702},null,null,{"$f":"VLOOKUP(G53,List!B:E,4,0)","v":"dcsm-EF_MEA1_HV_ON"},{"$f":"VLOOKUP(G53,List!B:G,6,0)","v":27},"2022-03-21T22:35:18",{"$f":"+\"0000    CALL \"&K53&\" -Run\"","v":"0000    CALL dcsm-EF_MEA1_HV_ON -Run"}]
[null,null,{"$f":"D53","v":"2022-03-21T23:08:57"},"2022-03-21T23:13:27",null,null,"HEP_HV_ON",{"$f":"VLOOKUP(G54,List!B:C,2,0)","v":270},null,null,{"$f":"VLOOKUP(G54,List!B:E,4,0)","v":"dcsm-EF_HEPE_HV_ON_OBS_START"},{"$f":"VLOOKUP(G54,List!B:G,6,0)","v":6},"2022-03-21T23:03:40",{"$f":"+\"0000    CALL \"&K54&\" -Run\"","v":"0000    CALL dcsm-EF_HEPE_HV_ON_OBS_START -Run"}]
[null,null,"2022-03-21T23:13:27","2022-03-21T23:14:09",null,"TLM mode change (MODE_5)","TLM_MODE_5",{"$f":"VLOOKUP(G55,List!B:C,2,0)","v":42},null,null,{"$f":"VLOOKUP(G55,List!B:E,4,0)","v":"dcsm-EF_BUS_TLM_MODE_5"},{"$f":"VLOOKUP(G55,List!B:G,6,0)","v":2},"2022-03-21T23:08:10","0000    CALL dcsm-EF_BUS_TLM_MODE_5 -Run"]
[null,null,"2022-03-21T23:14:09",{"$f":"C57","v":"2022-03-23T01:44:11"},"Observation F",null,null,{"$f":"(D56-C56)*3600*24","v":95402.000000886619},{"$f":"H56/3600","v":26.500555555801839},null,null,0,"2022-03-21T23:08:52",{"$f":"\"0000    WAIT_SEC  \"&TEXT(H56,\"#0\")","v":"0000    WAIT_SEC  95402"}]
[null,null,{"$f":"D57-H57/3600/24","v":"2022-03-23T01:44:11"},{"$f":"C58","v":"2022-03-23T01:44:53"},null,"TLM mode change (MODE_10)","TLM_MODE_10",{"$f":"VLOOKUP(G57,List!B:C,2,0)","v":42},null,null,{"$f":"VLOOKUP(G57,List!B:E,4,0)","v":"dcsm-EF_BUS_TLM_MODE_10"},{"$f":"VLOOKUP(G57,List!B:G,6,0)","v":2},"2022-03-23T01:38:54",{"$f":"+\"0000    CALL \"&K57&\" -Run\"","v":"0000    CALL dcsm-EF_BUS_TLM_MODE_10 -Run"}]
[null,null,{"$f":"D58-H58/3600/24","v":"2022-03-23T01:44:53"},{"$f":"C59","v":"2022-03-23T01:48:03"},null,"SI HV OFF","HEP_HV_OFF",{"$f":"VLOOKUP(G58,List!B:C,2,0)","v":190},null,null,{"$f":"VLOOKUP(G58,List!B:E,4,0)","v":"dcsm-EF_HEPE_HV_OFF_OBS_OFF"},{"$f":"VLOOKUP(G58,List!B:G,6,0)","v":5},"2022-03-23T01:39:36","0000    CALL dcsm-EF_HEPE_HV_OFF_OBS_OFF -Run"]
[null,null,{"$f":"D59-H59/3600/24","v":"2022-03-23T01:48:03"},{"$f":"C60","v":"2022-03-23T01:51:05"},null,null,"MEA1_HV_OFF",{"$f":"VLOOKUP(G59,List!B:C,2,0)","v":182},null,null,{"$f":"VLOOKUP(G59,List!B:E,4,0)","v":"dcsm-EF_MEA1_HV_OFF"},{"$f":"VLOOKUP(G59,List!B:G,6,0)","v":10},"2022-03-23T01:42:46","0000    CALL dcsm-EF_MEA1_HV_OFF -Run"]
[null,null,"2022-03-23T01:51:05",{"$f":"C60+H60/3600/24","v":"2022-03-23T02:11:05"},"WOL#6",null,{"$f":"(C61-D59)*24*3600","v":1800.0000002095476},1200,null,null,null,0,"2022-03-23T01:45:48",{"$f":"\"0000    WAIT_SEC  \"&TEXT(G60,\"#0\")","v":"0000    WAIT_SEC  1800"}]
[null,null,{"$f":"D60+10/60/24","v":"2022-03-23T02:21:05"},{"$f":"C61+H61/3600/24","v":"2022-03-23T02:49:27"},null,"SI HV ON","MEA1_HV_ON",{"$f":"VLOOKUP(G61,List!B:C,2,0)","v":1702},null,null,{"$f":"VLOOKUP(G61,List!B:E,4,0)","v":"dcsm-EF_MEA1_HV_ON"},{"$f":"VLOOKUP(G61,List!B:G,6,0)","v":27},"2022-03-23T02:15:48",{"$f":"+\"0000    CALL \"&K61&\" -Run\"","v":"0000    CALL dcsm-EF_MEA1_HV_ON -Run"}]
[null,null,{"$f":"D61","v":"2022-03-23T02:49:27"},"2022-03-23T02:53:57",null,null,"HEP_HV_ON",{"$f":"VLOOKUP(G62,List!B:C,2,0)","v":270},null,null,{"$f":"VLOOKUP(G62,List!B:E,4,0)","v":"dcsm-EF_HEPE_HV_ON_OBS_START"},{"$f":"VLOOKUP(G62,List!B:G,6,0)","v":6},"2022-03-23T02:44:10",{"$f":"+\"0000    CALL \"&K62&\" -Run\"","v":"0000    CALL dcsm-EF_HEPE_HV_ON_OBS_START -Run"}]
[null,null,"2022-03-23T02:53:57","2022-03-23T02:54:39",null,"TLM mode change (MODE_5)","TLM_MODE_5",{"$f":"VLOOKUP(G63,List!B:C,2,0)","v":42},null,null,{"$f":"VLOOKUP(G63,List!B:E,4,0)","v":"dcsm-EF_BUS_TLM_MODE_5"},{"$f":"VLOOKUP(G63,List!B:G,6,0)","v":2},"2022-03-23T02:48:40","0000    CALL dcsm-EF_BUS_TLM_MODE_5 -Run"]
[null,null,"2022-03-23T02:54:39",{"$f":"C65","v":"2022-03-24T10:29:42"},"Observation G",null,null,{"$f":"(D64-C64)*3600*24","v":113703.00000042189},{"$f":"H64/3600","v":31.584166666783858},null,null,0,"2022-03-23T02:49:22",{"$f":"\"0000    WAIT_SEC  \"&TEXT(H64,\"#0\")","v":"0000    WAIT_SEC  113703"}]
[null,null,{"$f":"D65-H65/3600/24","v":"2022-03-24T10:29:42"},{"$f":"C66","v":"2022-03-24T10:30:24"},null,"TLM mode change (MODE_10)","TLM_MODE_10",{"$f":"VLOOKUP(G65,List!B:C,2,0)","v":42},null,null,{"$f":"VLOOKUP(G65,List!B:E,4,0)","v":"dcsm-EF_BUS_TLM_MODE_10"},{"$f":"VLOOKUP(G65,List!B:G,6,0)","v":2},"2022-03-24T10:24:25",{"$f":"+\"0000    CALL \"&K65&\" -Run\"","v":"0000    CALL dcsm-EF_BUS_TLM_MODE_10 -Run"}]
[null,null,{"$f":"D66-H66/3600/24","v":"2022-03-24T10:30:24"},{"$f":"C67","v":"2022-03-24T10:33:34"},null,"SI HV OFF","HEP_HV_OFF",{"$f":"VLOOKUP(G66,List!B:C,2,0)","v":190},null,null,{"$f":"VLOOKUP(G66,List!B:E,4,0)","v":"dcsm-EF_HEPE_HV_OFF_OBS_OFF"},{"$f":"VLOOKUP(G66,List!B:G,6,0)","v":5},"2022-03-24T10:25:07","0000    CALL dcsm-EF_HEPE_HV_OFF_OBS_OFF -Run"]
[null,null,{"$f":"D67-H67/3600/24","v":"2022-03-24T10:33:34"},{"$f":"C68","v":"2022-03-24T10:36:36"},null,null,"MEA1_HV_OFF",{"$f":"VLOOKUP(G67,List!B:C,2,0)","v":182},null,null,{"$f":"VLOOKUP(G67,List!B:E,4,0)","v":"dcsm-EF_MEA1_HV_OFF"},{"$f":"VLOOKUP(G67,List!B:G,6,0)","v":10},"2022-03-24T10:28:17","0000    CALL dcsm-EF_MEA1_HV_OFF -Run"]
[null,null,"2022-03-24T10:36:36",{"$f":"C68+H68/3600/24","v":"2022-03-24T10:56:36"},"WOL#7",null,{"$f":"(C69-D67)*24*3600","v":1800.0000002095476},1200,null,null,null,0,"2022-03-24T10:31:19",{"$f":"\"0000    WAIT_SEC  \"&TEXT(G68,\"#0\")","v":"0000    WAIT_SEC  1800"}]
[null,null,{"$f":"D68+10/60/24","v":"2022-03-24T11:06:36"},{"$f":"C69+H69/3600/24","v":"2022-03-24T11:34:58"},null,"SI HV ON","MEA1_HV_ON",{"$f":"VLOOKUP(G69,List!B:C,2,0)","v":1702},null,null,{"$f":"VLOOKUP(G69,List!B:E,4,0)","v":"dcsm-EF_MEA1_HV_ON"},{"$f":"VLOOKUP(G69,List!B:G,6,0)","v":27},"2022-03-24T11:01:19",{"$f":"+\"0000    CALL \"&K69&\" -Run\"","v":"0000    CALL dcsm-EF_MEA1_HV_ON -Run"}]
[null,null,{"$f":"D69","v":"2022-03-24T11:34:58"},"2022-03-24T11:39:28",null,null,"HEP_HV_ON",{"$f":"VLOOKUP(G70,List!B:C,2,0)","v":270},null,null,{"$f":"VLOOKUP(G70,List!B:E,4,0)","v":"dcsm-EF_HEPE_HV_ON_OBS_START"},{"$f":"VLOOKUP(G70,List!B:G,6,0)","v":6},{"$f":"C70-317/3600/24","v":"2022-03-24T11:29:41"},{"$f":"+\"0000    CALL \"&K70&\" -Run\"","v":"0000    CALL dcsm-EF_HEPE_HV_ON_OBS_START -Run"}]
[null,null,"2022-03-24T11:39:28","2022-03-24T11:40:10",null,"TLM mode change (MODE_5)","TLM_MODE_5",{"$f":"VLOOKUP(G71,List!B:C,2,0)","v":42},null,null,{"$f":"VLOOKUP(G71,List!B:E,4,0)","v":"dcsm-EF_BUS_TLM_MODE_5"},{"$f":"VLOOKUP(G71,List!B:G,6,0)","v":2},"2022-03-24T11:34:11","0000    CALL dcsm-EF_BUS_TLM_MODE_5 -Run"]
[null,null,"2022-03-24T11:40:10",{"$f":"C73","v":"2022-03-25T23:00:00"},"Observation H",null,null,{"$f":"(D72-C72)*3600*24","v":127190.0000005262},{"$f":"H72/3600","v":35.330555555701721},null,null,0,"2022-03-24T11:34:53",{"$f":"\"0000    WAIT_SEC  \"&TEXT(H72,\"#0\")","v":"0000    WAIT_SEC  127190"}]
[null,null,{"$f":"D73-H73/3600/24","v":"2022-03-25T23:00:00"},{"$f":"C74","v":"2022-03-25T23:00:42"},null,"TLM mode change (MODE_10)","TLM_MODE_10",{"$f":"VLOOKUP(G73,List!B:C,2,0)","v":42},null,null,{"$f":"VLOOKUP(G73,List!B:E,4,0)","v":"dcsm-EF_BUS_TLM_MODE_10"},{"$f":"VLOOKUP(G73,List!B:G,6,0)","v":2},"2022-03-25T22:54:43",{"$f":"+\"0000    CALL \"&K73&\" -Run\"","v":"0000    CALL dcsm-EF_BUS_TLM_MODE_10 -Run"}]
[null,null,{"$f":"D74-H74/3600/24","v":"2022-03-25T23:00:42"},{"$f":"C75","v":"2022-03-25T23:03:52"},null,"SI HV OFF","HEP_HV_OFF",{"$f":"VLOOKUP(G74,List!B:C,2,0)","v":190},null,null,{"$f":"VLOOKUP(G74,List!B:E,4,0)","v":"dcsm-EF_HEPE_HV_OFF_OBS_OFF"},{"$f":"VLOOKUP(G74,List!B:G,6,0)","v":5},"2022-03-25T22:55:25","0000    CALL dcsm-EF_HEPE_HV_OFF_OBS_OFF -Run"]
[null,null,{"$f":"D75-H75/3600/24","v":"2022-03-25T23:03:52"},{"$f":"C76","v":"2022-03-25T23:06:54"},null,null,"MEA1_HV_OFF",{"$f":"VLOOKUP(G75,List!B:C,2,0)","v":182},null,null,{"$f":"VLOOKUP(G75,List!B:E,4,0)","v":"dcsm-EF_MEA1_HV_OFF"},{"$f":"VLOOKUP(G75,List!B:G,6,0)","v":10},"2022-03-25T22:58:35","0000    CALL dcsm-EF_MEA1_HV_OFF -Run"]
[null,null,"2022-03-25T23:06:54",{"$f":"C76+H76/3600/24","v":"2022-03-25T23:26:54"},"WOL#8",null,{"$f":"(C77-D75)*24*3600","v":1800.0000002095476},1200,null,null,null,0,"2022-03-25T23:01:37",{"$f":"\"0000    WAIT_SEC  \"&TEXT(G76,\"#0\")","v":"0000    WAIT_SEC  1800"}]
[null,null,{"$f":"D76+10/60/24","v":"2022-03-25T23:36:54"},{"$f":"C77+H77/3600/24","v":"2022-03-26T00:05:16"},null,"SI HV ON","MEA1_HV_ON",{"$f":"VLOOKUP(G77,List!B:C,2,0)","v":1702},null,null,{"$f":"VLOOKUP(G77,List!B:E,4,0)","v":"dcsm-EF_MEA1_HV_ON"},{"$f":"VLOOKUP(G77,List!B:G,6,0)","v":27},"2022-03-25T23:31:37",{"$f":"+\"0000    CALL \"&K77&\" -Run\"","v":"0000    CALL dcsm-EF_MEA1_HV_ON -Run"}]
[null,null,{"$f":"D77","v":"2022-03-26T00:05:16"},"2022-03-26T00:09:46",null,null,"HEP_HV_ON",{"$f":"VLOOKUP(G78,List!B:C,2,0)","v":270},null,null,{"$f":"VLOOKUP(G78,List!B:E,4,0)","v":"dcsm-EF_HEPE_HV_ON_OBS_START"},{"$f":"VLOOKUP(G78,List!B:G,6,0)","v":6},"2022-03-25T23:59:59",{"$f":"+\"0000    CALL \"&K78&\" -Run\"","v":"0000    CALL dcsm-EF_HEPE_HV_ON_OBS_START -Run"}]
[null,null,"2022-03-26T00:09:46","2022-03-26T00:10:28",null,"TLM mode change (MODE_5)","TLM_MODE_5",{"$f":"VLOOKUP(G79,List!B:C,2,0)","v":42},null,null,{"$f":"VLOOKUP(G79,List!B:E,4,0)","v":"dcsm-EF_BUS_TLM_MODE_5"},{"$f":"VLOOKUP(G79,List!B:G,6,0)","v":2},"2022-03-26T00:04:29","0000    CALL dcsm-EF_BUS_TLM_MODE_5 -Run"]
[null,null,"2022-03-26T00:10:28",{"$f":"C81","v":"2022-03-26T23:08:24"},"Observation I",null,null,{"$f":"(D80-C80)*3600*24","v":82675.999999511987},{"$f":"H80/3600","v":22.965555555419996},null,null,0,"2022-03-26T00:05:11",{"$f":"\"0000    WAIT_SEC  \"&TEXT(H80,\"#0\")","v":"0000    WAIT_SEC  82676"}]
[null,null,{"$f":"D81-H81/3600/24","v":"2022-03-26T23:08:24"},{"$f":"C82","v":"2022-03-26T23:09:06"},null,"TLM mode change (MODE_10)","TLM_MODE_10",{"$f":"VLOOKUP(G81,List!B:C,2,0)","v":42},null,null,{"$f":"VLOOKUP(G81,List!B:E,4,0)","v":"dcsm-EF_BUS_TLM_MODE_10"},{"$f":"VLOOKUP(G81,List!B:G,6,0)","v":2},"2022-03-26T23:03:07",{"$f":"+\"0000    CALL \"&K81&\" -Run\"","v":"0000    CALL dcsm-EF_BUS_TLM_MODE_10 -Run"}]
[null,null,{"$f":"D82-H82/3600/24","v":"2022-03-26T23:09:06"},{"$f":"C83","v":"2022-03-26T23:12:16"},null,"SI HV OFF","HEP_HV_OFF",{"$f":"VLOOKUP(G82,List!B:C,2,0)","v":190},null,null,{"$f":"VLOOKUP(G82,List!B:E,4,0)","v":"dcsm-EF_HEPE_HV_OFF_OBS_OFF"},{"$f":"VLOOKUP(G82,List!B:G,6,0)","v":5},"2022-03-26T23:03:49","0000    CALL dcsm-EF_HEPE_HV_OFF_OBS_OFF -Run"]
[null,null,{"$f":"D83-H83/3600/24","v":"2022-03-26T23:12:16"},{"$f":"C84","v":"2022-03-26T23:15:22"},null,null,"MEA1_HV_SCAN_OFF",{"$f":"VLOOKUP(G83,List!B:C,2,0)","v":186},null,null,{"$f":"VLOOKUP(G83,List!B:E,4,0)","v":"dcsm-EF_MEA1_HV_SCAN_OFF"},{"$f":"VLOOKUP(G83,List!B:G,6,0)","v":12},"2022-03-26T23:06:59","0000    CALL dcsm-EF_MEA1_HV_SCAN_OFF -Run"]
[null,null,{"$f":"D84-H84/3600/24","v":"2022-03-26T23:15:22"},{"$f":"C85","v":"2022-03-26T23:16:32"},null,"SI OFF","HEP_OFF",{"$f":"VLOOKUP(G84,List!B:C,2,0)","v":70},null,null,{"$f":"VLOOKUP(G84,List!B:E,4,0)","v":"dcsm-EF_HEPE_OFF_STOP"},{"$f":"VLOOKUP(G84,List!B:G,6,0)","v":4},"2022-03-26T23:10:05",{"$f":"+\"0000    CALL \"&K84&\" -Run\"","v":"0000    CALL dcsm-EF_HEPE_OFF_STOP -Run"}]
[null,null,"2022-03-26T23:16:32","2022-03-26T23:19:12",null,null,"MEA1_OFF",{"$f":"VLOOKUP(G85,List!B:C,2,0)","v":160},null,null,{"$f":"VLOOKUP(G85,List!B:E,4,0)","v":"dcsm-EF_MEA1_OFF"},{"$f":"VLOOKUP(G85,List!B:G,6,0)","v":4},"2022-03-26T23:11:15",{"$f":"+\"0000    CALL \"&K85&\" -Run\"","v":"0000    CALL dcsm-EF_MEA1_OFF -Run"}]
[null,null,"2022-03-26T23:19:12","2022-03-26T23:19:20",null,null,"MGF_OFF",{"$f":"VLOOKUP(G86,List!B:C,2,0)","v":8},null,null,{"$f":"VLOOKUP(G86,List!B:E,4,0)","v":"dcsm-EF_MGF_OFF"},{"$f":"VLOOKUP(G86,List!B:G,6,0)","v":1},"2022-03-26T23:13:55","0000    CALL dcsm-EF_MGF_OFF -Run"]
[null,null,"2022-03-26T23:19:20",{"$f":"C88","v":"2022-03-26T23:20:00"},null,null,"PME_OFF",{"$f":"VLOOKUP(G87,List!B:C,2,0)","v":40},null,null,{"$f":"VLOOKUP(G87,List!B:E,4,0)","v":"dcsm-EF_PME_OFF"},{"$f":"VLOOKUP(G87,List!B:G,6,0)","v":1},"2022-03-26T23:14:03","0000    CALL dcsm-EF_PME_OFF -Run"]
[null,null,"2022-03-26T23:20:00",{"$f":"C89","v":"2022-03-27"},null,null,null,{"$f":"(D88-C88)*3600*24","v":2400.0000002793968},null,null,null,0,"2022-03-26T23:14:43",{"$f":"\"0000    WAIT_SEC  \"&TEXT(H88,\"#0\")","v":"0000    WAIT_SEC  2400"}]
[null,null,"2022-03-27",{"$f":"C89+H89/3600/24","v":"2022-03-27T00:04:52"},null,"SI ON","MEA1_ON_SETUP_SW",{"$f":"VLOOKUP(G89,List!B:C,2,0)","v":292},null,null,{"$f":"VLOOKUP(G89,List!B:E,4,0)","v":"dcsm-EF_MEA1_ON_SW"},12,"2022-03-26T23:54:43",{"$f":"+\"0000    CALL \"&K89&\" -Run\"","v":"0000    CALL dcsm-EF_MEA1_ON_SW -Run"}]
[null,null,{"$f":"D89","v":"2022-03-27T00:04:52"},"2022-03-27T00:14:34",null,null,"MIA_ON_ASIC_LDET",{"$f":"VLOOKUP(G90,List!B:C,2,0)","v":582},null,null,{"$f":"VLOOKUP(G90,List!B:E,4,0)","v":"dcsm-EF_MIA_ON_ASIC_LDET"},11,"2022-03-26T23:59:35","0000    CALL dcsm-EF_MIA_ON_ASIC_LDET -Run"]
[null,null,{"$f":"D90","v":"2022-03-27T00:14:34"},"2022-03-27T00:32:46",null,null,"MSA_ON_SETUP_C",{"$f":"VLOOKUP(G91,List!B:C,2,0)","v":1092},null,null,{"$f":"VLOOKUP(G91,List!B:E,4,0)","v":"dcsm-EF_MSA_ON_C"},15,"2022-03-27T00:09:17","0000    CALL dcsm-EF_MSA_ON_C -Run"]
[null,null,{"$f":"D91","v":"2022-03-27T00:32:46"},"2022-03-27T00:37:08",null,"SI HV ON","MIA_HV_ON_SW_RC",{"$f":"VLOOKUP(G92,List!B:C,2,0)","v":262},null,null,{"$f":"VLOOKUP(G92,List!B:E,4,0)","v":"dcsm-EF_MIA_HV_ON_SW_RC"},7,{"$f":"C92-317/3600/24","v":"2022-03-27T00:27:29"},{"$f":"+\"0000    CALL \"&K92&\" -Run\"","v":"0000    CALL dcsm-EF_MIA_HV_ON_SW_RC -Run"}]
[null,null,"2022-03-27T00:37:08","2022-03-27T01:05:30",null,null,"MEA1_HV_ON",{"$f":"VLOOKUP(G93,List!B:C,2,0)","v":1702},null,null,{"$f":"VLOOKUP(G93,List!B:E,4,0)","v":"dcsm-EF_MEA1_HV_ON"},27,{"$f":"C93-317/3600/24","v":"2022-03-27T00:31:51"},{"$f":"+\"0000    CALL \"&K93&\" -Run\"","v":"0000    CALL dcsm-EF_MEA1_HV_ON -Run"}]
[null,null,"2022-03-27T01:05:30","2022-03-27T01:31:43",null,null,"MSA_HV_ON_1_MFB_SF",{"$f":"VLOOKUP(G94,List!B:C,2,0)","v":1573},null,null,{"$f":"VLOOKUP(G94,List!B:E,4,0)","v":"dcsm-EF_MSA_HV_ON_1_MFB_Safe"},108,{"$f":"C94-317/3600/24","v":"2022-03-27T01:00:13"},{"$f":"+\"0000    CALL \"&K94&\" -Run\"","v":"0000    CALL dcsm-EF_MSA_HV_ON_1_MFB_Safe -Run"}]
[null,null,"2022-03-27T01:31:43","2022-03-27T02:02:43",null,null,"MSA_HV_ON_2_MFB_SF",{"$f":"VLOOKUP(G95,List!B:C,2,0)","v":1860},null,null,{"$f":"VLOOKUP(G95,List!B:E,4,0)","v":"dcsm-EF_MSA_HV_ON_2_MFB_Safe"},124,"2022-03-27T01:26:26","0000    CALL dcsm-EF_MSA_HV_ON_2_MFB_Safe -Run"]
[null,null,"2022-03-27T02:02:43","2022-03-27T02:03:25",null,"TLM mode change (MODE_5)","TLM_MODE_5",{"$f":"VLOOKUP(G96,List!B:C,2,0)","v":42},null,null,{"$f":"VLOOKUP(G96,List!B:E,4,0)","v":"dcsm-EF_BUS_TLM_MODE_5"},2,"2022-03-27T01:57:26","0000    CALL dcsm-EF_BUS_TLM_MODE_5 -Run"]
[null,null,{"$f":"D96","v":"2022-03-27T02:03:25"},{"$f":"C98","v":"2022-03-27T19:28:36"},"Observation J",null,null,{"$f":"(D97-C97)*3600*24","v":62711.000000755303},{"$f":"H97/3600","v":17.419722222432029},null,null,0,"2022-03-27T01:58:08",{"$f":"\"0000    WAIT_SEC  \"&TEXT(H97,\"#0\")","v":"0000    WAIT_SEC  62711"}]
[null,null,{"$f":"D98-H98/3600/24","v":"2022-03-27T19:28:36"},{"$f":"C99","v":"2022-03-27T19:29:18"},null,"TLM mode change (MODE_10)","TLM_MODE_10",{"$f":"VLOOKUP(G98,List!B:C,2,0)","v":42},null,null,{"$f":"VLOOKUP(G98,List!B:E,4,0)","v":"dcsm-EF_BUS_TLM_MODE_10"},2,"2022-03-27T19:23:19",{"$f":"+\"0000    CALL \"&K98&\" -Run\"","v":"0000    CALL dcsm-EF_BUS_TLM_MODE_10 -Run"}]
[null,null,{"$f":"D99-H99/3600/24","v":"2022-03-27T19:29:18"},{"$f":"C100","v":"2022-03-27T19:42:12"},null,"SI HV OFF","MSA_HV_OFF_VFB",{"$f":"VLOOKUP(G99,List!B:C,2,0)","v":774},null,null,{"$f":"VLOOKUP(G99,List!B:E,4,0)","v":"dcsm-EF_MSA_HV_OFF_VFB"},25,"2022-03-27T19:24:01","0000    CALL dcsm-EF_MSA_HV_OFF_VFB -Run"]
[null,null,"2022-03-27T19:42:12","2022-03-27T19:45:14",null,null,"MEA1_HV_OFF",{"$f":"VLOOKUP(G100,List!B:C,2,0)","v":182},null,null,{"$f":"VLOOKUP(G100,List!B:E,4,0)","v":"dcsm-EF_MEA1_HV_OFF"},10,"2022-03-27T19:36:55","0000    CALL dcsm-EF_MEA1_HV_OFF -Run"]
[null,null,"2022-03-27T19:45:14","2022-03-27T19:46:14",null,null,"MIA_HV_OFF",{"$f":"VLOOKUP(G101,List!B:C,2,0)","v":60},null,null,{"$f":"VLOOKUP(G101,List!B:E,4,0)","v":"dcsm-EF_MIA_HV_OFF"},1,"2022-03-27T19:39:57","0000    CALL dcsm-EF_MIA_HV_OFF -Run"]
[null,null,"2022-03-27T19:46:14",{"$f":"C102+H102/3600/24","v":"2022-03-27T20:06:14"},"WOL#9",null,{"$f":"(C103-D101)*24*3600","v":1800.0000002095476},1200,null,null,null,0,"2022-03-27T19:40:57",{"$f":"\"0000    WAIT_SEC  \"&TEXT(G102,\"#0\")","v":"0000    WAIT_SEC  1800"}]
[null,null,{"$f":"D102+10/60/24","v":"2022-03-27T20:16:14"},{"$f":"C103+H103/3600/24","v":"2022-03-27T20:20:36"},null,"SI HV ON","MIA_HV_ON_SW_RC",{"$f":"VLOOKUP(G103,List!B:C,2,0)","v":262},null,null,{"$f":"VLOOKUP(G103,List!B:E,4,0)","v":"dcsm-EF_MIA_HV_ON_SW_RC"},7,{"$f":"C103-317/3600/24","v":"2022-03-27T20:10:57"},{"$f":"+\"0000    CALL \"&K103&\" -Run\"","v":"0000    CALL dcsm-EF_MIA_HV_ON_SW_RC -Run"}]
[null,null,{"$f":"D103","v":"2022-03-27T20:20:36"},"2022-03-27T20:48:58",null,null,"MEA1_HV_ON",{"$f":"VLOOKUP(G104,List!B:C,2,0)","v":1702},null,null,{"$f":"VLOOKUP(G104,List!B:E,4,0)","v":"dcsm-EF_MEA1_HV_ON"},27,{"$f":"C104-317/3600/24","v":"2022-03-27T20:15:19"},{"$f":"+\"0000    CALL \"&K104&\" -Run\"","v":"0000    CALL dcsm-EF_MEA1_HV_ON -Run"}]
[null,null,{"$f":"D104","v":"2022-03-27T20:48:58"},"2022-03-27T21:15:11",null,null,"MSA_HV_ON_1_MFB_SF",{"$f":"VLOOKUP(G105,List!B:C,2,0)","v":1573},null,null,{"$f":"VLOOKUP(G105,List!B:E,4,0)","v":"dcsm-EF_MSA_HV_ON_1_MFB_Safe"},108,{"$f":"C105-317/3600/24","v":"2022-03-27T20:43:41"},{"$f":"+\"0000    CALL \"&K105&\" -Run\"","v":"0000    CALL dcsm-EF_MSA_HV_ON_1_MFB_Safe -Run"}]
[null,null,"2022-03-27T21:15:11","2022-03-27T21:46:11",null,null,"MSA_HV_ON_2_MFB_SF",{"$f":"VLOOKUP(G106,List!B:C,2,0)","v":1860},null,null,{"$f":"VLOOKUP(G106,List!B:E,4,0)","v":"dcsm-EF_MSA_HV_ON_2_MFB_Safe"},124,"2022-03-27T21:09:54","0000    CALL dcsm-EF_MSA_HV_ON_2_MFB_Safe -Run"]
[null,null,{"$f":"D106","v":"2022-03-27T21:46:11"},"2022-03-27T21:46:53",null,"TLM mode change (MODE_5)","TLM_MODE_5",{"$f":"VLOOKUP(G107,List!B:C,2,0)","v":42},null,null,{"$f":"VLOOKUP(G107,List!B:E,4,0)","v":"dcsm-EF_BUS_TLM_MODE_5"},2,"2022-03-27T21:40:54","0000    CALL dcsm-EF_BUS_TLM_MODE_5 -Run"]
[null,null,{"$f":"D107","v":"2022-03-27T21:46:53"},{"$f":"C109","v":"2022-03-28T20:22:31"},"Observation K",null,null,{"$f":"(D108-C108)*3600*24","v":81338.000000431202},{"$f":"H108/3600","v":22.593888889008667},null,null,0,"2022-03-27T21:41:36",{"$f":"\"0000    WAIT_SEC  \"&TEXT(H108,\"#0\")","v":"0000    WAIT_SEC  81338"}]
[null,null,{"$f":"D109-H109/3600/24","v":"2022-03-28T20:22:31"},{"$f":"C110","v":"2022-03-28T20:23:13"},null,"TLM mode change (MODE_10)","TLM_MODE_10",{"$f":"VLOOKUP(G109,List!B:C,2,0)","v":42},null,null,{"$f":"VLOOKUP(G109,List!B:E,4,0)","v":"dcsm-EF_BUS_TLM_MODE_10"},2,"2022-03-28T20:17:14",{"$f":"+\"0000    CALL \"&K109&\" -Run\"","v":"0000    CALL dcsm-EF_BUS_TLM_MODE_10 -Run"}]
[null,null,{"$f":"D110-H110/3600/24","v":"2022-03-28T20:23:13"},{"$f":"C111","v":"2022-03-28T20:36:07"},null,"SI HV OFF","MSA_HV_OFF_VFB",{"$f":"VLOOKUP(G110,List!B:C,2,0)","v":774},null,null,{"$f":"VLOOKUP(G110,List!B:E,4,0)","v":"dcsm-EF_MSA_HV_OFF_VFB"},25,"2022-03-28T20:17:56","0000    CALL dcsm-EF_MSA_HV_OFF_VFB -Run"]
[null,null,"2022-03-28T20:36:07","2022-03-28T20:39:09",null,null,"MEA1_HV_OFF",{"$f":"VLOOKUP(G111,List!B:C,2,0)","v":182},null,null,{"$f":"VLOOKUP(G111,List!B:E,4,0)","v":"dcsm-EF_MEA1_HV_OFF"},10,"2022-03-28T20:30:50","0000    CALL dcsm-EF_MEA1_HV_OFF -Run"]
[null,null,"2022-03-28T20:39:09","2022-03-28T20:40:09",null,null,"MIA_HV_OFF",{"$f":"VLOOKUP(G112,List!B:C,2,0)","v":60},null,null,{"$f":"VLOOKUP(G112,List!B:E,4,0)","v":"dcsm-EF_MIA_HV_OFF"},1,"2022-03-28T20:33:52","0000    CALL dcsm-EF_MIA_HV_OFF -Run"]
[null,null,"2022-03-28T20:40:09",{"$f":"C113+H113/3600/24","v":"2022-03-28T21:00:09"},"WOL#10",null,{"$f":"(C114-D112)*24*3600","v":1800.0000002095476},1200,null,null,null,0,"2022-03-28T20:34:52",{"$f":"\"0000    WAIT_SEC  \"&TEXT(G113,\"#0\")","v":"0000    WAIT_SEC  1800"}]
[null,null,{"$f":"D113+10/60/24","v":"2022-03-28T21:10:09"},{"$f":"C114+H114/3600/24","v":"2022-03-28T21:14:31"},null,"SI HV ON","MIA_HV_ON_SW_RC",{"$f":"VLOOKUP(G114,List!B:C,2,0)","v":262},null,null,{"$f":"VLOOKUP(G114,List!B:E,4,0)","v":"dcsm-EF_MIA_HV_ON_SW_RC"},7,{"$f":"C114-317/3600/24","v":"2022-03-28T21:04:52"},{"$f":"+\"0000    CALL \"&K114&\" -Run\"","v":"0000    CALL dcsm-EF_MIA_HV_ON_SW_RC -Run"}]
[null,null,{"$f":"D114","v":"2022-03-28T21:14:31"},"2022-03-28T21:42:53",null,null,"MEA1_HV_ON",{"$f":"VLOOKUP(G115,List!B:C,2,0)","v":1702},null,null,{"$f":"VLOOKUP(G115,List!B:E,4,0)","v":"dcsm-EF_MEA1_HV_ON"},27,{"$f":"C115-317/3600/24","v":"2022-03-28T21:09:14"},{"$f":"+\"0000    CALL \"&K115&\" -Run\"","v":"0000    CALL dcsm-EF_MEA1_HV_ON -Run"}]
[null,null,{"$f":"D115","v":"2022-03-28T21:42:53"},"2022-03-28T22:09:06",null,null,"MSA_HV_ON_1_MFB_SF",{"$f":"VLOOKUP(G116,List!B:C,2,0)","v":1573},null,null,{"$f":"VLOOKUP(G116,List!B:E,4,0)","v":"dcsm-EF_MSA_HV_ON_1_MFB_Safe"},108,{"$f":"C116-317/3600/24","v":"2022-03-28T21:37:36"},{"$f":"+\"0000    CALL \"&K116&\" -Run\"","v":"0000    CALL dcsm-EF_MSA_HV_ON_1_MFB_Safe -Run"}]
[null,null,"2022-03-28T22:09:06","2022-03-28T22:40:06",null,null,"MSA_HV_ON_2_MFB_SF",{"$f":"VLOOKUP(G117,List!B:C,2,0)","v":1860},null,null,{"$f":"VLOOKUP(G117,List!B:E,4,0)","v":"dcsm-EF_MSA_HV_ON_2_MFB_Safe"},124,"2022-03-28T22:03:49","0000    CALL dcsm-EF_MSA_HV_ON_2_MFB_Safe -Run"]
[null,null,{"$f":"D117","v":"2022-03-28T22:40:06"},"2022-03-28T22:40:48",null,"TLM mode change (MODE_5)","TLM_MODE_5",{"$f":"VLOOKUP(G118,List!B:C,2,0)","v":42},null,null,{"$f":"VLOOKUP(G118,List!B:E,4,0)","v":"dcsm-EF_BUS_TLM_MODE_5"},2,"2022-03-28T22:34:49","0000    CALL dcsm-EF_BUS_TLM_MODE_5 -Run"]
[null,null,{"$f":"D118","v":"2022-03-28T22:40:48"},{"$f":"C120","v":"2022-03-29T23:30:38"},"Observation L",null,null,{"$f":"(D119-C119)*3600*24","v":89389.999999268912},{"$f":"H119/3600","v":24.830555555352475},null,null,0,"2022-03-28T22:35:31",{"$f":"\"0000    WAIT_SEC  \"&TEXT(H119,\"#0\")","v":"0000    WAIT_SEC  89390"}]
[null,null,{"$f":"D120-H120/3600/24","v":"2022-03-29T23:30:38"},{"$f":"C121","v":"2022-03-29T23:31:20"},null,"TLM mode change (MODE_10)","TLM_MODE_10",{"$f":"VLOOKUP(G120,List!B:C,2,0)","v":42},null,null,{"$f":"VLOOKUP(G120,List!B:E,4,0)","v":"dcsm-EF_BUS_TLM_MODE_10"},2,"2022-03-29T23:25:21",{"$f":"+\"0000    CALL \"&K120&\" -Run\"","v":"0000    CALL dcsm-EF_BUS_TLM_MODE_10 -Run"}]
[null,null,{"$f":"D121-H121/3600/24","v":"2022-03-29T23:31:20"},{"$f":"C122","v":"2022-03-29T23:44:14"},null,"SI HV OFF","MSA_HV_OFF_VFB",{"$f":"VLOOKUP(G121,List!B:C,2,0)","v":774},null,null,{"$f":"VLOOKUP(G121,List!B:E,4,0)","v":"dcsm-EF_MSA_HV_OFF_VFB"},25,"2022-03-29T23:26:03","0000    CALL dcsm-EF_MSA_HV_OFF_VFB -Run"]
[null,null,"2022-03-29T23:44:14","2022-03-29T23:47:20",null,null,"MEA1_HV_SCAN_OFF",{"$f":"VLOOKUP(G122,List!B:C,2,0)","v":186},null,null,{"$f":"VLOOKUP(G122,List!B:E,4,0)","v":"dcsm-EF_MEA1_HV_SCAN_OFF"},12,"2022-03-29T23:38:57","0000    CALL dcsm-EF_MEA1_HV_SCAN_OFF -Run"]
[null,null,"2022-03-29T23:47:20","2022-03-29T23:48:20",null,null,"MIA_HV_OFF",{"$f":"VLOOKUP(G123,List!B:C,2,0)","v":60},null,null,{"$f":"VLOOKUP(G123,List!B:E,4,0)","v":"dcsm-EF_MIA_HV_OFF"},1,"2022-03-29T23:42:03","0000    CALL dcsm-EF_MIA_HV_OFF -Run"]
[null,null,"2022-03-29T23:48:20","2022-03-29T23:54:40",null,"SI OFF","MSA_OFF",{"$f":"VLOOKUP(G124,List!B:C,2,0)","v":380},null,null,{"$f":"VLOOKUP(G124,List!B:E,4,0)","v":"dcsm-EF_MSA_OFF"},25,"2022-03-29T23:43:03","0000    CALL dcsm-EF_MSA_OFF -Run"]
[null,null,"2022-03-29T23:54:40","2022-03-29T23:57:20",null,null,"MIA_OFF",{"$f":"VLOOKUP(G125,List!B:C,2,0)","v":160},null,null,{"$f":"VLOOKUP(G125,List!B:E,4,0)","v":"dcsm-EF_MIA_OFF"},4,"2022-03-29T23:49:23","0000    CALL dcsm-EF_MIA_OFF -Run"]
[null,null,"2022-03-29T23:57:20","2022-03-30",null,null,"MEA1_OFF",{"$f":"VLOOKUP(G126,List!B:C,2,0)","v":160},null,null,{"$f":"VLOOKUP(G126,List!B:E,4,0)","v":"dcsm-EF_MEA1_OFF"},4,"2022-03-29T23:52:03","0000    CALL dcsm-EF_MEA1_OFF -Run"]
[null,null,"2022-03-30",{"$f":"C127+H127/3600/24","v":"2022-03-30T00:04:52"},null,"SI ON","MEA1_ON_SETUP_SW",{"$f":"VLOOKUP(G127,List!B:C,2,0)","v":292},null,null,"dcsm-EF_MEA1_ON_SW",12,"2022-03-29T23:54:43","0000    CALL dcsm-EF_MEA1_ON_SW -Run"]
[null,null,{"$f":"D127","v":"2022-03-30T00:04:52"},{"$f":"C128+H128/3600/24","v":"2022-03-30T00:25:22"},null,null,"HEP_ON_SETUP",{"$f":"VLOOKUP(G128,List!B:C,2,0)","v":1230},null,null,"dcsm-EF_HEP_ON_START_for_TL",34,"2022-03-29T23:59:35","0000    CALL dcsm-EF_HEP_ON_START_for_TL -Run"]
[null,null,{"$f":"D128","v":"2022-03-30T00:25:22"},{"$f":"C129+H129/3600/24","v":"2022-03-30T00:26:42"},null,null,"PME_ON",{"$f":"VLOOKUP(G129,List!B:C,2,0)","v":80},null,null,"dcsm-EF_PME_ON",2,"2022-03-30T00:20:05","0000    CALL dcsm-EF_PME_ON -Run"]
[null,null,"2022-03-30T00:26:42","2022-03-30T00:26:56",null,null,"MGF_ON_SETUP",{"$f":"VLOOKUP(G130,List!B:C,2,0)","v":14},null,null,"dcsm-EF_MGF_ON",3,"2022-03-30T00:21:25","0000    CALL dcsm-EF_MGF_ON -Run"]
[null,null,{"$f":"D130","v":"2022-03-30T00:26:56"},"2022-03-30T00:55:18",null,"SI HV ON","MEA1_HV_ON",{"$f":"VLOOKUP(G131,List!B:C,2,0)","v":1702},null,null,"dcsm-EF_MEA1_HV_ON",27,"2022-03-30T00:21:39",{"$f":"+\"0000    CALL \"&K131&\" -Run\"","v":"0000    CALL dcsm-EF_MEA1_HV_ON -Run"}]
[null,null,{"$f":"D131","v":"2022-03-30T00:55:18"},"2022-03-30T00:59:48",null,null,"HEP_HV_ON",{"$f":"VLOOKUP(G132,List!B:C,2,0)","v":270},null,null,"dcsm-EF_HEPE_HV_ON_OBS_START",6,"2022-03-30T00:50:01",{"$f":"+\"0000    CALL \"&K132&\" -Run\"","v":"0000    CALL dcsm-EF_HEPE_HV_ON_OBS_START -Run"}]
[null,null,"2022-03-30T00:59:48","2022-03-30T01:00:30",null,"TLM mode change (MODE_5)","TLM_MODE_5",{"$f":"VLOOKUP(G133,List!B:C,2,0)","v":42},null,null,"dcsm-EF_BUS_TLM_MODE_5",2,"2022-03-30T00:54:31","0000    CALL dcsm-EF_BUS_TLM_MODE_5 -Run"]
[null,null,"2022-03-30T01:00:30",{"$f":"C135","v":"2022-03-30T01:44:11"},"Observation M",null,null,{"$f":"(D134-C134)*3600*24","v":2621.0000010207295},{"$f":"H134/3600","v":0.72805555583909154},null,null,0,"2022-03-30T00:55:13",{"$f":"\"0000    WAIT_SEC  \"&TEXT(H134,\"#0\")","v":"0000    WAIT_SEC  2621"}]
[null,null,{"$f":"D135-H135/3600/24","v":"2022-03-30T01:44:11"},{"$f":"C136","v":"2022-03-30T01:44:53"},null,"TLM mode change (MODE_10)","TLM_MODE_10",{"$f":"VLOOKUP(G135,List!B:C,2,0)","v":42},null,null,"dcsm-EF_BUS_TLM_MODE_10",2,"2022-03-30T01:38:54",{"$f":"+\"0000    CALL \"&K135&\" -Run\"","v":"0000    CALL dcsm-EF_BUS_TLM_MODE_10 -Run"}]
[null,null,{"$f":"D136-H136/3600/24","v":"2022-03-30T01:44:53"},{"$f":"C137","v":"2022-03-30T01:48:03"},null,"SI HV OFF","HEP_HV_OFF",{"$f":"VLOOKUP(G136,List!B:C,2,0)","v":190},null,null,"dcsm-EF_HEPE_HV_OFF_OBS_OFF",5,"2022-03-30T01:39:36","0000    CALL dcsm-EF_HEPE_HV_OFF_OBS_OFF -Run"]
[null,null,{"$f":"D137-H137/3600/24","v":"2022-03-30T01:48:03"},{"$f":"C138","v":"2022-03-30T01:51:05"},null,null,"MEA1_HV_OFF",{"$f":"VLOOKUP(G137,List!B:C,2,0)","v":182},null,null,"dcsm-EF_MEA1_HV_OFF",10,"2022-03-30T01:42:46","0000    CALL dcsm-EF_MEA1_HV_OFF -Run"]
[null,null,"2022-03-30T01:51:05",{"$f":"C138+H138/3600/24","v":"2022-03-30T02:11:05"},"WOL#11",null,{"$f":"(C139-D137)*24*3600","v":1800.0000002095476},1200,null,null,null,0,"2022-03-30T01:45:48",{"$f":"\"0000    WAIT_SEC  \"&TEXT(G138,\"#0\")","v":"0000    WAIT_SEC  1800"}]
[null,null,{"$f":"D138+10/60/24","v":"2022-03-30T02:21:05"},{"$f":"C139+H139/3600/24","v":"2022-03-30T02:49:27"},null,"SI HV ON","MEA1_HV_ON",{"$f":"VLOOKUP(G139,List!B:C,2,0)","v":1702},null,null,"dcsm-EF_MEA1_HV_ON",27,"2022-03-30T02:15:48",{"$f":"+\"0000    CALL \"&K139&\" -Run\"","v":"0000    CALL dcsm-EF_MEA1_HV_ON -Run"}]
[null,null,{"$f":"D139","v":"2022-03-30T02:49:27"},"2022-03-30T02:53:57",null,null,"HEP_HV_ON",{"$f":"VLOOKUP(G140,List!B:C,2,0)","v":270},null,null,"dcsm-EF_HEPE_HV_ON_OBS_START",6,"2022-03-30T02:44:10",{"$f":"+\"0000    CALL \"&K140&\" -Run\"","v":"0000    CALL dcsm-EF_HEPE_HV_ON_OBS_START -Run"}]
[null,null,"2022-03-30T02:53:57","2022-03-30T02:54:39",null,"TLM mode change (MODE_5)","TLM_MODE_5",{"$f":"VLOOKUP(G141,List!B:C,2,0)","v":42},null,null,"dcsm-EF_BUS_TLM_MODE_5",2,"2022-03-30T02:48:40","0000    CALL dcsm-EF_BUS_TLM_MODE_5 -Run"]
[null,null,"2022-03-30T02:54:39",{"$f":"C143","v":"2022-03-31T10:13:00"},"Observation N",null,null,{"$f":"(D142-C142)*3600*24","v":112701.0000000475},{"$f":"H142/3600","v":31.305833333346527},null,null,0,"2022-03-30T02:49:22",{"$f":"\"0000    WAIT_SEC  \"&TEXT(H142,\"#0\")","v":"0000    WAIT_SEC  112701"}]
[null,null,{"$f":"D143-H143/3600/24","v":"2022-03-31T10:13:00"},{"$f":"C144","v":"2022-03-31T10:13:42"},null,"TLM mode change (MODE_10)","TLM_MODE_10",{"$f":"VLOOKUP(G143,List!B:C,2,0)","v":42},null,null,"dcsm-EF_BUS_TLM_MODE_10",2,"2022-03-31T10:07:43",{"$f":"+\"0000    CALL \"&K143&\" -Run\"","v":"0000    CALL dcsm-EF_BUS_TLM_MODE_10 -Run"}]
[null,null,{"$f":"D144-H144/3600/24","v":"2022-03-31T10:13:42"},{"$f":"C145","v":"2022-03-31T10:16:52"},null,"SI HV OFF","HEP_HV_OFF",{"$f":"VLOOKUP(G144,List!B:C,2,0)","v":190},null,null,"dcsm-EF_HEPE_HV_OFF_OBS_OFF",5,"2022-03-31T10:08:25","0000    CALL dcsm-EF_HEPE_HV_OFF_OBS_OFF -Run"]
[null,null,{"$f":"D145-H145/3600/24","v":"2022-03-31T10:16:52"},{"$f":"C146","v":"2022-03-31T10:19:54"},null,null,"MEA1_HV_OFF",{"$f":"VLOOKUP(G145,List!B:C,2,0)","v":182},null,null,"dcsm-EF_MEA1_HV_OFF",10,"2022-03-31T10:11:35","0000    CALL dcsm-EF_MEA1_HV_OFF -Run"]
[null,null,"2022-03-31T10:19:54",{"$f":"C146+H146/3600/24","v":"2022-03-31T10:39:54"},"WOL#12",null,{"$f":"(C147-D145)*24*3600","v":1800.0000002095476},1200,null,null,null,0,"2022-03-31T10:14:37",{"$f":"\"0000    WAIT_SEC  \"&TEXT(G146,\"#0\")","v":"0000    WAIT_SEC  1800"}]
[null,null,{"$f":"D146+10/60/24","v":"2022-03-31T10:49:54"},{"$f":"C147+H147/3600/24","v":"2022-03-31T11:18:16"},null,"SI HV ON","MEA1_HV_ON",{"$f":"VLOOKUP(G147,List!B:C,2,0)","v":1702},null,null,"dcsm-EF_MEA1_HV_ON",27,"2022-03-31T10:44:37",{"$f":"+\"0000    CALL \"&K147&\" -Run\"","v":"0000    CALL dcsm-EF_MEA1_HV_ON -Run"}]
[null,null,{"$f":"D147","v":"2022-03-31T11:18:16"},"2022-03-31T11:22:46",null,null,"HEP_HV_ON",{"$f":"VLOOKUP(G148,List!B:C,2,0)","v":270},null,null,"dcsm-EF_HEPE_HV_ON_OBS_START",6,"2022-03-31T11:12:59",{"$f":"+\"0000    CALL \"&K148&\" -Run\"","v":"0000    CALL dcsm-EF_HEPE_HV_ON_OBS_START -Run"}]
[null,null,"2022-03-31T11:22:46","2022-03-31T11:23:28",null,"TLM mode change (MODE_5)","TLM_MODE_5",{"$f":"VLOOKUP(G149,List!B:C,2,0)","v":42},null,null,"dcsm-EF_BUS_TLM_MODE_5",2,"2022-03-31T11:17:29","0000    CALL dcsm-EF_BUS_TLM_MODE_5 -Run"]
[null,null,"2022-03-31T11:23:28",{"$f":"C151","v":"2022-04-01T18:47:00"},"Observation O",null,null,{"$f":"(D150-C150)*3600*24","v":113012.00000045355},{"$f":"H150/3600","v":31.392222222348209},null,null,0,"2022-03-31T11:18:11",{"$f":"\"0000    WAIT_SEC  \"&TEXT(H150,\"#0\")","v":"0000    WAIT_SEC  113012"}]
[null,null,{"$f":"D151-H151/3600/24","v":"2022-04-01T18:47:00"},{"$f":"C152","v":"2022-04-01T18:47:42"},null,"TLM mode change (MODE_10)","TLM_MODE_10",{"$f":"VLOOKUP(G151,List!B:C,2,0)","v":42},null,null,"dcsm-EF_BUS_TLM_MODE_10",2,"2022-04-01T18:41:43",{"$f":"+\"0000    CALL \"&K151&\" -Run\"","v":"0000    CALL dcsm-EF_BUS_TLM_MODE_10 -Run"}]
[null,null,{"$f":"D152-H152/3600/24","v":"2022-04-01T18:47:42"},{"$f":"C153","v":"2022-04-01T18:50:52"},null,"SI HV OFF","HEP_HV_OFF",{"$f":"VLOOKUP(G152,List!B:C,2,0)","v":190},null,null,"dcsm-EF_HEPE_HV_OFF_OBS_OFF",5,"2022-04-01T18:42:25","0000    CALL dcsm-EF_HEPE_HV_OFF_OBS_OFF -Run"]
[null,null,{"$f":"D153-H153/3600/24","v":"2022-04-01T18:50:52"},{"$f":"C154","v":"2022-04-01T18:53:54"},null,null,"MEA1_HV_OFF",{"$f":"VLOOKUP(G153,List!B:C,2,0)","v":182},null,null,"dcsm-EF_MEA1_HV_OFF",10,"2022-04-01T18:45:35","0000    CALL dcsm-EF_MEA1_HV_OFF -Run"]
[null,null,"2022-04-01T18:53:54",{"$f":"C154+H154/3600/24","v":"2022-04-01T19:13:54"},"WOL#13",null,{"$f":"(C155-D153)*24*3600","v":1800.0000002095476},1200,null,null,null,0,"2022-04-01T18:48:37",{"$f":"\"0000    WAIT_SEC  \"&TEXT(G154,\"#0\")","v":"0000    WAIT_SEC  1800"}]
[null,null,{"$f":"D154+10/60/24","v":"2022-04-01T19:23:54"},{"$f":"C155+H155/3600/24","v":"2022-04-01T19:52:16"},null,"SI HV ON","MEA1_HV_ON",{"$f":"VLOOKUP(G155,List!B:C,2,0)","v":1702},null,null,"dcsm-EF_MEA1_HV_ON",27,"2022-04-01T19:18:37",{"$f":"+\"0000    CALL \"&K155&\" -Run\"","v":"0000    CALL dcsm-EF_MEA1_HV_ON -Run"}]
[null,null,{"$f":"D155","v":"2022-04-01T19:52:16"},"2022-04-01T19:56:46",null,null,"HEP_HV_ON",{"$f":"VLOOKUP(G156,List!B:C,2,0)","v":270},null,null,"dcsm-EF_HEPE_HV_ON_OBS_START",6,"2022-04-01T19:46:59",{"$f":"+\"0000    CALL \"&K156&\" -Run\"","v":"0000    CALL dcsm-EF_HEPE_HV_ON_OBS_START -Run"}]
[null,null,"2022-04-01T19:56:46","2022-04-01T19:57:28",null,"TLM mode change (MODE_5)","TLM_MODE_5",{"$f":"VLOOKUP(G157,List!B:C,2,0)","v":42},null,null,"dcsm-EF_BUS_TLM_MODE_5",2,"2022-04-01T19:51:29","0000    CALL dcsm-EF_BUS_TLM_MODE_5 -Run"]
[null,null,"2022-04-01T19:57:28",{"$f":"C159","v":"2022-04-02T21:35:18"},"Observation P",null,null,{"$f":"(D158-C158)*3600*24","v":92270.000000484288},{"$f":"H158/3600","v":25.63055555569008},null,null,0,"2022-04-01T19:52:11",{"$f":"\"0000    WAIT_SEC  \"&TEXT(H158,\"#0\")","v":"0000    WAIT_SEC  92270"}]
[null,null,{"$f":"D159-H159/3600/24","v":"2022-04-02T21:35:18"},{"$f":"C160","v":"2022-04-02T21:36:00"},null,"TLM mode change (MODE_10)","TLM_MODE_10",{"$f":"VLOOKUP(G159,List!B:C,2,0)","v":42},null,null,"dcsm-EF_BUS_TLM_MODE_10",2,"2022-04-02T21:30:01",{"$f":"+\"0000    CALL \"&K159&\" -Run\"","v":"0000    CALL dcsm-EF_BUS_TLM_MODE_10 -Run"}]
[null,null,{"$f":"D160-H160/3600/24","v":"2022-04-02T21:36:00"},{"$f":"C161","v":"2022-04-02T21:39:10"},null,"SI HV OFF","HEP_HV_OFF",{"$f":"VLOOKUP(G160,List!B:C,2,0)","v":190},null,null,"dcsm-EF_HEPE_HV_OFF_OBS_OFF",5,"2022-04-02T21:30:43","0000    CALL dcsm-EF_HEPE_HV_OFF_OBS_OFF -Run"]
[null,null,{"$f":"D161-H161/3600/24","v":"2022-04-02T21:39:10"},{"$f":"C162","v":"2022-04-02T21:42:12"},null,null,"MEA1_HV_OFF",{"$f":"VLOOKUP(G161,List!B:C,2,0)","v":182},null,null,"dcsm-EF_MEA1_HV_OFF",10,"2022-04-02T21:33:53","0000    CALL dcsm-EF_MEA1_HV_OFF -Run"]
[null,null,"2022-04-02T21:42:12",{"$f":"C162+H162/3600/24","v":"2022-04-02T22:02:12"},"WOL#14",null,{"$f":"(C163-D161)*24*3600","v":1800.0000002095476},1200,null,null,null,0,"2022-04-02T21:36:55",{"$f":"\"0000    WAIT_SEC  \"&TEXT(G162,\"#0\")","v":"0000    WAIT_SEC  1800"}]
[null,null,{"$f":"D162+10/60/24","v":"2022-04-02T22:12:12"},{"$f":"C163+H163/3600/24","v":"2022-04-02T22:40:34"},null,"SI HV ON","MEA1_HV_ON",{"$f":"VLOOKUP(G163,List!B:C,2,0)","v":1702},null,null,"dcsm-EF_MEA1_HV_ON",27,"2022-04-02T22:06:55",{"$f":"+\"0000    CALL \"&K163&\" -Run\"","v":"0000    CALL dcsm-EF_MEA1_HV_ON -Run"}]
[null,null,{"$f":"D163","v":"2022-04-02T22:40:34"},"2022-04-02T22:45:04",null,null,"HEP_HV_ON",{"$f":"VLOOKUP(G164,List!B:C,2,0)","v":270},null,null,"dcsm-EF_HEPE_HV_ON_OBS_START",6,"2022-04-02T22:35:17",{"$f":"+\"0000    CALL \"&K164&\" -Run\"","v":"0000    CALL dcsm-EF_HEPE_HV_ON_OBS_START -Run"}]
[null,null,"2022-04-02T22:45:04","2022-04-02T22:45:46",null,"TLM mode change (MODE_5)","TLM_MODE_5",{"$f":"VLOOKUP(G165,List!B:C,2,0)","v":42},null,null,"dcsm-EF_BUS_TLM_MODE_5",2,"2022-04-02T22:39:47","0000    CALL dcsm-EF_BUS_TLM_MODE_5 -Run"]
[null,null,"2022-04-02T22:45:46",{"$f":"C167","v":"2022-04-03T20:47:35"},"Observation Q",null,null,{"$f":"(D166-C166)*3600*24","v":79309.00000075344},{"$f":"H166/3600","v":22.030277777987067},null,null,0,"2022-04-02T22:40:29",{"$f":"\"0000    WAIT_SEC  \"&TEXT(H166,\"#0\")","v":"0000    WAIT_SEC  79309"}]
[null,null,{"$f":"D167-H167/3600/24","v":"2022-04-03T20:47:35"},{"$f":"C168","v":"2022-04-03T20:48:17"},null,"TLM mode change (MODE_10)","TLM_MODE_10",{"$f":"VLOOKUP(G167,List!B:C,2,0)","v":42},null,null,"dcsm-EF_BUS_TLM_MODE_10",2,"2022-04-03T20:42:18",{"$f":"+\"0000    CALL \"&K167&\" -Run\"","v":"0000    CALL dcsm-EF_BUS_TLM_MODE_10 -Run"}]
[null,null,{"$f":"D168-H168/3600/24","v":"2022-04-03T20:48:17"},{"$f":"C169","v":"2022-04-03T20:51:27"},null,"SI HV OFF","HEP_HV_OFF",{"$f":"VLOOKUP(G168,List!B:C,2,0)","v":190},null,null,"dcsm-EF_HEPE_HV_OFF_OBS_OFF",5,"2022-04-03T20:43:00","0000    CALL dcsm-EF_HEPE_HV_OFF_OBS_OFF -Run"]
[null,null,{"$f":"D169-H169/3600/24","v":"2022-04-03T20:51:27"},{"$f":"C170","v":"2022-04-03T20:54:29"},null,null,"MEA1_HV_OFF",{"$f":"VLOOKUP(G169,List!B:C,2,0)","v":182},null,null,"dcsm-EF_MEA1_HV_OFF",10,"2022-04-03T20:46:10","0000    CALL dcsm-EF_MEA1_HV_OFF -Run"]
[null,null,"2022-04-03T20:54:29",{"$f":"C170+H170/3600/24","v":"2022-04-03T21:14:29"},"WOL#15",null,{"$f":"(C171-D169)*24*3600","v":1800.0000002095476},1200,null,null,null,0,"2022-04-03T20:49:12",{"$f":"\"0000    WAIT_SEC  \"&TEXT(G170,\"#0\")","v":"0000    WAIT_SEC  1800"}]
[null,null,{"$f":"D170+10/60/24","v":"2022-04-03T21:24:29"},{"$f":"C171+H171/3600/24","v":"2022-04-03T21:52:51"},null,"SI HV ON","MEA1_HV_ON",{"$f":"VLOOKUP(G171,List!B:C,2,0)","v":1702},null,null,"dcsm-EF_MEA1_HV_ON",27,"2022-04-03T21:19:12",{"$f":"+\"0000    CALL \"&K171&\" -Run\"","v":"0000    CALL dcsm-EF_MEA1_HV_ON -Run"}]
[null,null,{"$f":"D171","v":"2022-04-03T21:52:51"},"2022-04-03T21:57:21",null,null,"HEP_HV_ON",{"$f":"VLOOKUP(G172,List!B:C,2,0)","v":270},null,null,"dcsm-EF_HEPE_HV_ON_OBS_START",6,"2022-04-03T21:47:34",{"$f":"+\"0000    CALL \"&K172&\" -Run\"","v":"0000    CALL dcsm-EF_HEPE_HV_ON_OBS_START -Run"}]
[null,null,"2022-04-03T21:57:21","2022-04-03T21:58:03",null,"TLM mode change (MODE_5)","TLM_MODE_5",{"$f":"VLOOKUP(G173,List!B:C,2,0)","v":42},null,null,"dcsm-EF_BUS_TLM_MODE_5",2,"2022-04-03T21:52:04","0000    CALL dcsm-EF_BUS_TLM_MODE_5 -Run"]
[null,null,"2022-04-03T21:58:03",{"$f":"C175","v":"2022-04-04T20:37:15"},"Observation R",null,null,{"$f":"(D174-C174)*3600*24","v":81552.000000793487},{"$f":"H174/3600","v":22.653333333553746},null,null,0,"2022-04-03T21:52:46",{"$f":"\"0000    WAIT_SEC  \"&TEXT(H174,\"#0\")","v":"0000    WAIT_SEC  81552"}]
[null,null,{"$f":"D175-H175/3600/24","v":"2022-04-04T20:37:15"},{"$f":"C176","v":"2022-04-04T20:37:57"},null,"TLM mode change (MODE_10)","TLM_MODE_10",{"$f":"VLOOKUP(G175,List!B:C,2,0)","v":42},null,null,"dcsm-EF_BUS_TLM_MODE_10",2,"2022-04-04T20:31:58",{"$f":"+\"0000    CALL \"&K175&\" -Run\"","v":"0000    CALL dcsm-EF_BUS_TLM_MODE_10 -Run"}]
[null,null,{"$f":"D176-H176/3600/24","v":"2022-04-04T20:37:57"},{"$f":"C177","v":"2022-04-04T20:41:07"},null,"SI HV OFF","HEP_HV_OFF",{"$f":"VLOOKUP(G176,List!B:C,2,0)","v":190},null,null,"dcsm-EF_HEPE_HV_OFF_OBS_OFF",5,"2022-04-04T20:32:40","0000    CALL dcsm-EF_HEPE_HV_OFF_OBS_OFF -Run"]
[null,null,{"$f":"D177-H177/3600/24","v":"2022-04-04T20:41:07"},{"$f":"C178","v":"2022-04-04T20:44:09"},null,null,"MEA1_HV_OFF",{"$f":"VLOOKUP(G177,List!B:C,2,0)","v":182},null,null,"dcsm-EF_MEA1_HV_OFF",10,"2022-04-04T20:35:50","0000    CALL dcsm-EF_MEA1_HV_OFF -Run"]
[null,null,"2022-04-04T20:44:09",{"$f":"C178+H178/3600/24","v":"2022-04-04T21:04:09"},"WOL#16",null,{"$f":"(C179-D177)*24*3600","v":1800.0000002095476},1200,null,null,null,0,"2022-04-04T20:38:52",{"$f":"\"0000    WAIT_SEC  \"&TEXT(G178,\"#0\")","v":"0000    WAIT_SEC  1800"}]
[null,null,{"$f":"D178+10/60/24","v":"2022-04-04T21:14:09"},{"$f":"C179+H179/3600/24","v":"2022-04-04T21:42:31"},null,"SI HV ON","MEA1_HV_ON",{"$f":"VLOOKUP(G179,List!B:C,2,0)","v":1702},null,null,"dcsm-EF_MEA1_HV_ON",27,"2022-04-04T21:08:52",{"$f":"+\"0000    CALL \"&K179&\" -Run\"","v":"0000    CALL dcsm-EF_MEA1_HV_ON -Run"}]
[null,null,{"$f":"D179","v":"2022-04-04T21:42:31"},"2022-04-04T21:47:01",null,null,"HEP_HV_ON",{"$f":"VLOOKUP(G180,List!B:C,2,0)","v":270},null,null,"dcsm-EF_HEPE_HV_ON_OBS_START",6,{"$f":"C180-317/3600/24","v":"2022-04-04T21:37:14"},{"$f":"+\"0000    CALL \"&K180&\" -Run\"","v":"0000    CALL dcsm-EF_HEPE_HV_ON_OBS_START -Run"}]
[null,null,"2022-04-04T21:47:01","2022-04-04T21:47:43",null,"TLM mode change (MODE_5)","TLM_MODE_5",{"$f":"VLOOKUP(G181,List!B:C,2,0)","v":42},null,null,"dcsm-EF_BUS_TLM_MODE_5",2,"2022-04-04T21:41:44","0000    CALL dcsm-EF_BUS_TLM_MODE_5 -Run"]
[null,null,"2022-04-04T21:47:43",{"$f":"C183","v":"2022-04-06T01:18:53"},"Observation S",null,null,{"$f":"(D182-C182)*3600*24","v":99070.000000228174},{"$f":"H182/3600","v":27.519444444507826},null,null,0,"2022-04-04T21:42:26",{"$f":"\"0000    WAIT_SEC  \"&TEXT(H182,\"#0\")","v":"0000    WAIT_SEC  99070"}]
[null,null,{"$f":"D183-H183/3600/24","v":"2022-04-06T01:18:53"},{"$f":"C184","v":"2022-04-06T01:19:35"},null,"TLM mode change (MODE_10)","TLM_MODE_10",{"$f":"VLOOKUP(G183,List!B:C,2,0)","v":42},null,null,"dcsm-EF_BUS_TLM_MODE_10",2,"2022-04-06T01:13:36",{"$f":"+\"0000    CALL \"&K183&\" -Run\"","v":"0000    CALL dcsm-EF_BUS_TLM_MODE_10 -Run"}]
[null,null,{"$f":"D184-H184/3600/24","v":"2022-04-06T01:19:35"},{"$f":"C185","v":"2022-04-06T01:22:45"},null,"SI HV OFF","HEP_HV_OFF",{"$f":"VLOOKUP(G184,List!B:C,2,0)","v":190},null,null,"dcsm-EF_HEPE_HV_OFF_OBS_OFF",5,"2022-04-06T01:14:18","0000    CALL dcsm-EF_HEPE_HV_OFF_OBS_OFF -Run"]
[null,null,{"$f":"D185-H185/3600/24","v":"2022-04-06T01:22:45"},{"$f":"C186","v":"2022-04-06T01:25:47"},null,null,"MEA1_HV_OFF",{"$f":"VLOOKUP(G185,List!B:C,2,0)","v":182},null,null,"dcsm-EF_MEA1_HV_OFF",10,"2022-04-06T01:17:28","0000    CALL dcsm-EF_MEA1_HV_OFF -Run"]
[null,null,"2022-04-06T01:25:47",{"$f":"C186+H186/3600/24","v":"2022-04-06T01:45:47"},"WOL#17",null,{"$f":"(C187-D185)*24*3600","v":1800.0000002095476},1200,null,null,null,0,"2022-04-06T01:20:30",{"$f":"\"0000    WAIT_SEC  \"&TEXT(G186,\"#0\")","v":"0000    WAIT_SEC  1800"}]
[null,null,{"$f":"D186+10/60/24","v":"2022-04-06T01:55:47"},{"$f":"C187+H187/3600/24","v":"2022-04-06T02:24:09"},null,"SI HV ON","MEA1_HV_ON",{"$f":"VLOOKUP(G187,List!B:C,2,0)","v":1702},null,null,"dcsm-EF_MEA1_HV_ON",27,"2022-04-06T01:50:30",{"$f":"+\"0000    CALL \"&K187&\" -Run\"","v":"0000    CALL dcsm-EF_MEA1_HV_ON -Run"}]
[null,null,{"$f":"D187","v":"2022-04-06T02:24:09"},"2022-04-06T02:28:39",null,null,"HEP_HV_ON",{"$f":"VLOOKUP(G188,List!B:C,2,0)","v":270},null,null,"dcsm-EF_HEPE_HV_ON_OBS_START",6,"2022-04-06T02:18:52",{"$f":"+\"0000    CALL \"&K188&\" -Run\"","v":"0000    CALL dcsm-EF_HEPE_HV_ON_OBS_START -Run"}]
[null,null,"2022-04-06T02:28:39","2022-04-06T02:29:21",null,"TLM mode change (MODE_5)","TLM_MODE_5",{"$f":"VLOOKUP(G189,List!B:C,2,0)","v":42},null,null,"dcsm-EF_BUS_TLM_MODE_5",2,"2022-04-06T02:23:22","0000    CALL dcsm-EF_BUS_TLM_MODE_5 -Run"]
[null,null,"2022-04-06T02:29:21",{"$f":"C191","v":"2022-04-07T01:15:24"},"Observation T",null,null,{"$f":"(D190-C190)*3600*24","v":81963.000000687316},{"$f":"H190/3600","v":22.767500000190921},null,null,0,"2022-04-06T02:24:04",{"$f":"\"0000    WAIT_SEC  \"&TEXT(H190,\"#0\")","v":"0000    WAIT_SEC  81963"}]
[null,null,{"$f":"D191-H191/3600/24","v":"2022-04-07T01:15:24"},{"$f":"C192","v":"2022-04-07T01:16:06"},null,"TLM mode change (MODE_10)","TLM_MODE_10",{"$f":"VLOOKUP(G191,List!B:C,2,0)","v":42},null,null,"dcsm-EF_BUS_TLM_MODE_10",2,"2022-04-07T01:10:07",{"$f":"+\"0000    CALL \"&K191&\" -Run\"","v":"0000    CALL dcsm-EF_BUS_TLM_MODE_10 -Run"}]
[null,null,{"$f":"D192-H192/3600/24","v":"2022-04-07T01:16:06"},{"$f":"C193","v":"2022-04-07T01:19:16"},null,"SI HV OFF","HEP_HV_OFF",{"$f":"VLOOKUP(G192,List!B:C,2,0)","v":190},null,null,"dcsm-EF_HEPE_HV_OFF_OBS_OFF",5,"2022-04-07T01:10:49","0000    CALL dcsm-EF_HEPE_HV_OFF_OBS_OFF -Run"]
[null,null,{"$f":"D193-H193/3600/24","v":"2022-04-07T01:19:16"},{"$f":"C194","v":"2022-04-07T01:22:18"},null,null,"MEA1_HV_OFF",{"$f":"VLOOKUP(G193,List!B:C,2,0)","v":182},null,null,"dcsm-EF_MEA1_HV_OFF",10,"2022-04-07T01:13:59","0000    CALL dcsm-EF_MEA1_HV_OFF -Run"]
[null,null,"2022-04-07T01:22:18",{"$f":"C194+H194/3600/24","v":"2022-04-07T01:42:18"},"WOL#18",null,{"$f":"(C195-D193)*24*3600","v":1800.0000002095476},1200,null,null,null,0,"2022-04-07T01:17:01",{"$f":"\"0000    WAIT_SEC  \"&TEXT(G194,\"#0\")","v":"0000    WAIT_SEC  1800"}]
[null,null,{"$f":"D194+10/60/24","v":"2022-04-07T01:52:18"},{"$f":"C195+H195/3600/24","v":"2022-04-07T02:20:40"},null,"SI HV ON","MEA1_HV_ON",{"$f":"VLOOKUP(G195,List!B:C,2,0)","v":1702},null,null,"dcsm-EF_MEA1_HV_ON",27,"2022-04-07T01:47:01",{"$f":"+\"0000    CALL \"&K195&\" -Run\"","v":"0000    CALL dcsm-EF_MEA1_HV_ON -Run"}]
[null,null,{"$f":"D195","v":"2022-04-07T02:20:40"},"2022-04-07T02:25:10",null,null,"HEP_HV_ON",{"$f":"VLOOKUP(G196,List!B:C,2,0)","v":270},null,null,"dcsm-EF_HEPE_HV_ON_OBS_START",6,"2022-04-07T02:15:23",{"$f":"+\"0000    CALL \"&K196&\" -Run\"","v":"0000    CALL dcsm-EF_HEPE_HV_ON_OBS_START -Run"}]
[null,null,"2022-04-07T02:25:10","2022-04-07T02:25:52",null,"TLM mode change (MODE_5)","TLM_MODE_5",{"$f":"VLOOKUP(G197,List!B:C,2,0)","v":42},null,null,"dcsm-EF_BUS_TLM_MODE_5",2,"2022-04-07T02:19:53","0000    CALL dcsm-EF_BUS_TLM_MODE_5 -Run"]
[null,null,"2022-04-07T02:25:52",{"$f":"C199","v":"2022-04-07T23:32:44"},"Observation U",null,null,{"$f":"(D198-C198)*3600*24","v":76012.000000127591},{"$f":"H198/3600","v":21.114444444479886},null,null,0,"2022-04-07T02:20:35",{"$f":"\"0000    WAIT_SEC  \"&TEXT(H198,\"#0\")","v":"0000    WAIT_SEC  76012"}]
[null,null,{"$f":"D199-H199/3600/24","v":"2022-04-07T23:32:44"},{"$f":"C200","v":"2022-04-07T23:33:26"},null,"TLM mode change (MODE_10)","TLM_MODE_10",{"$f":"VLOOKUP(G199,List!B:C,2,0)","v":42},null,null,"dcsm-EF_BUS_TLM_MODE_10",2,"2022-04-07T23:27:27",{"$f":"+\"0000    CALL \"&K199&\" -Run\"","v":"0000    CALL dcsm-EF_BUS_TLM_MODE_10 -Run"}]
[null,null,{"$f":"D200-H200/3600/24","v":"2022-04-07T23:33:26"},{"$f":"C201","v":"2022-04-07T23:36:36"},null,"SI HV OFF","HEP_HV_OFF",{"$f":"VLOOKUP(G200,List!B:C,2,0)","v":190},null,null,"dcsm-EF_HEPE_HV_OFF_OBS_OFF",5,"2022-04-07T23:28:09","0000    CALL dcsm-EF_HEPE_HV_OFF_OBS_OFF -Run"]
[null,null,{"$f":"D201-H201/3600/24","v":"2022-04-07T23:36:36"},{"$f":"C202","v":"2022-04-07T23:39:42"},null,null,"MEA1_HV_SCAN_OFF",{"$f":"VLOOKUP(G201,List!B:C,2,0)","v":186},null,null,"dcsm-EF_MEA1_HV_SCAN_OFF",12,"2022-04-07T23:31:19","0000    CALL dcsm-EF_MEA1_HV_SCAN_OFF -Run"]
[null,null,{"$f":"D202-H202/3600/24","v":"2022-04-07T23:39:42"},{"$f":"C203","v":"2022-04-07T23:40:52"},null,"SI OFF","HEP_OFF",{"$f":"VLOOKUP(G202,List!B:C,2,0)","v":70},null,null,"dcsm-EF_HEPE_OFF_STOP",4,"2022-04-07T23:34:25",{"$f":"+\"0000    CALL \"&K202&\" -Run\"","v":"0000    CALL dcsm-EF_HEPE_OFF_STOP -Run"}]
[null,null,"2022-04-07T23:40:52","2022-04-07T23:43:32",null,null,"MEA1_OFF",{"$f":"VLOOKUP(G203,List!B:C,2,0)","v":160},null,null,"dcsm-EF_MEA1_OFF",4,"2022-04-07T23:35:35",{"$f":"+\"0000    CALL \"&K203&\" -Run\"","v":"0000    CALL dcsm-EF_MEA1_OFF -Run"}]
[null,null,"2022-04-07T23:43:32","2022-04-07T23:43:40",null,null,"MGF_OFF",{"$f":"VLOOKUP(G204,List!B:C,2,0)","v":8},null,null,"dcsm-EF_MGF_OFF",1,"2022-04-07T23:38:15","0000    CALL dcsm-EF_MGF_OFF -Run"]
[null,null,"2022-04-07T23:43:40","2022-04-07T23:44:20",null,null,"PME_OFF",{"$f":"VLOOKUP(G205,List!B:C,2,0)","v":40},null,null,"dcsm-EF_PME_OFF",1,"2022-04-07T23:38:23","0000    CALL dcsm-EF_PME_OFF -Run"]
[null,null,"2022-04-07T23:44:20","2022-04-07T23:46:20",null,"MDP OFF","MDP_OFF_D",{"$f":"VLOOKUP(G206,List!B:C,2,0)","v":120},null,null,"dcsm-EF_MDP_POWEROFF",3,"2022-04-07T23:39:03","0000    CALL dcsm-EF_MDP_POWEROFF -Run"]
[null,null,"2022-04-07T23:46:20","2022-04-07T23:50:00",null,"BUS OFF","BUS_OFF_D",{"$f":"VLOOKUP(G207,List!B:C,2,0)","v":220},null,null,"dcsm-EF_BUS_MONI_OFF",5,"2022-04-07T23:41:03","0000    CALL dcsm-EF_BUS_MONI_OFF -Run"]
[null,null,"2022-04-07T23:50:00",{"$f":"C208+H208/3600/24","v":"2022-04-08T00:10:00"},null,null,"END",1200,null,null,null,0,{"$f":"C208-317/3600/24","v":"2022-04-07T23:44:43"}]