{"text_format":"1","workbook":"xlsx","n_sheets":11,"sheets":["確認事項","変更履歴","実行","チェック表","START","END","LOOP","COMMENT","List","WOL","obs_sequence"],"not_rendered":{"charts":0,"images":0,"macros":1,"external_links":0,"defined_names":7,"comments":0,"pivot_tables":0},"unopened":[],"bounds":{"document_bytes":16777216,"sheet_cells":100000,"rows_first":2000,"rows_last":500,"rows_between":2000,"halvings":0,"cell_chars":16384,"cell_head_chars":4096},"cells_cut":0,"cells_raw":0,"read":"whole","date_system":"1900"}

{"sheet":"確認事項","index":0,"n_rows":1,"n_cols":4,"rows_kept":1,"cut":false,"hidden":false,"merged":[]}
["NO.","確認事項","回答","CLOSE"]

{"sheet":"変更履歴","index":1,"n_rows":11,"n_cols":4,"rows_kept":11,"cut":false,"hidden":false,"merged":[[0,0,0,3]]}
["MMO観測計画作成ツール　変更履歴"]
["日付","Ver","変更者","変更内容"]
["2021-08-06",1,"山下","-"]
["2021-08-09",2,"arare","コマンド出力のmain　end部分を出力するように修正した\nListにMSA_HV_ON_VFB1、MSA_HV_ON_VFB2追加\nObs_sequence XOR Time行追記\nコマンドの開始終了時間をOBS時間に変更"]
["2021-08-17",3,"arare","WOLの時間をG列から取得するように変更"]
["2021-08-25",4,"arare","COMMENTにmainstart,endのXDOR,XOR用追記"]
["2021-09-27",5,"arare","＃refの対応 obserbation Aから昇順につける"]
["2021-10-19",6,"arare","ListにMSAHV追記"]
["2021-10-21",7,"arare","Listを最新にした"]
["2022-03-08",8,"arare","Listを最新にした、XDOR用コメントはプログラム改修により使用なし"]
{"$rows_left_out":2}
{"sheet":"実行","index":2,"n_rows":16,"n_cols":6,"rows_kept":16,"cut":false,"hidden":false,"merged":[]}
[]
[]
[]
[]
[]
[]
[]
[null,null,null,null,null,"【操作】"]
["C番号",10,null,null,null,"「実行」シートの「観測作成」を押下。"]
["M番号",631205,null,null,null,"→「START」、「LOOP」、「END」を「obs_sequence」に貼り付けます。"]
{"$rows_left_out":7}
{"sheet":"チェック表","index":3,"n_rows":19,"n_cols":4,"rows_kept":19,"cut":false,"hidden":true,"merged":[]}
[]
[null,"コマンド作成時注意項目"]
[null,"NO.","項目","チェック"]
[null,1,"\n観測期間開始時に「dcsm-EF_BUS_MONI_ON」手順が入っていることを確認する。\nただし、前回の観測終了時に「dcsm-EF_BUS_MONI_OFF」を実行していない場合は確認不要。\n","□"]
[null,2,"\n観測期間開始日に、観測する機器の”ON”手順が入っていることを確認する。\nただし、PWI、MGF、MAST、WPTを\"ON\"にする場合は、PWI、MGF、MAST、WPTよりも先にPMEが\"ON\"となっていること。\n※クルーズ観測中は、MEA1,HEPE,MGFのみ”ON”\n","□"]
[null,3,"\nTLM MODEが観測前に「５」　観測終了後は「１０」　となっていることを確認する\n","□"]
[null,4,"\n観測時間が”86400”を超えるていないか確認する。\n超えていた場合は、main計画作成時に途中ダミーコマンドを挿入すること\n"]
[null,5,"WOLの開始時刻が正しいことを確認する","□"]
[null,6,"\nWOLの時間を確認　HV　OFFになっていることを確認する\n↓\nクルーズ観測を行っている機器(HEPE、ENA、MIA、MEA、MSAのみ)\nフライバイを行っている機器(MSA,PWI,MGF,MEA,ENA,MIA,HEPE,MDM)\n","□"]
[null,7,"\nWOL終了時刻＋10以降にのHVがONになっていることを確認する。\nクルーズ観測を行っている機器(HEPE、ENA、MIA、MEA、MSAのみ)\nフライバイを行っている機器(MSA,PWI,MGF,MEA,ENA,MIA,HEPE,MDM)\n","□"]
{"$rows_left_out":10}
{"sheet":"START","index":4,"n_rows":10,"n_cols":21,"rows_kept":10,"cut":false,"hidden":false,"merged":[[5,5,9,5]]}
["Start","End","Start","End","Event","Activity","Procedure","Duration (sec)",null,null,null,"cmd count",null,"cmd count"]
[null,null,{"$f":"#REF!","v":{"$error":"#REF!"}},{"$f":"C2+H2/3600/24","v":{"$error":"#REF!"}},null,"BUS_ON","BUS_SETUP_D",{"$f":"VLOOKUP(G2,List!B:C,2,0)","v":577},null,null,{"$f":"VLOOKUP(G2,List!B:E,4,0)","v":"dcsm-EF_BUS_MONI_ON"},{"$f":"VLOOKUP(G2,List!B:G,6,0)","v":20},{"$f":"C2-317/3600/24","v":{"$error":"#REF!"}},{"$f":"+\"0000    CALL \"&K2&\" -Run\"","v":"0000    CALL dcsm-EF_BUS_MONI_ON -Run"},null,"CALL","dcsm-EF_BUS_MONI_ON",null,null,null,{"$f":"+IF(Q2=K2,\"\",\"x\")","v":""}]
[null,null,{"$f":"D2","v":{"$error":"#REF!"}},{"$f":"C3+H3/3600/24","v":{"$error":"#REF!"}},null,"MDP ON","MDP_ON_D",{"$f":"VLOOKUP(G3,List!B:C,2,0)","v":509},null,null,{"$f":"VLOOKUP(G3,List!B:E,4,0)","v":"dcsm-EF_MDP_ON"},{"$f":"VLOOKUP(G3,List!B:G,6,0)","v":11},{"$error":"#REF!"},"0000    CALL dcsm-EF_MDP_ON -Run",null,"CALL","dcsm-EF_MDP_ON",null,null,null,{"$f":"+IF(Q3=K3,\"\",\"x\")","v":""}]
[null,null,{"$f":"D3","v":{"$error":"#REF!"}},{"$f":"C4+H4/3600/24","v":{"$error":"#REF!"}},null,null,"MDP_CRUISE_SET",{"$f":"VLOOKUP(G4,List!B:C,2,0)","v":42},null,null,{"$f":"VLOOKUP(G4,List!B:E,4,0)","v":"dcsm-EF_MDP_CRUISE_SET"},{"$f":"VLOOKUP(G4,List!B:G,6,0)","v":2},{"$error":"#REF!"},"0000    CALL dcsm-EF_MDP_CRUISE_SET -Run"]
[null,null,{"$error":"#REF!"},{"$error":"#REF!"},null,"TLM mode change (MODE_10)","TLM_MODE_10",{"$f":"VLOOKUP(G5,List!B:C,2,0)","v":42},null,null,{"$f":"VLOOKUP(G5,List!B:E,4,0)","v":"dcsm-EF_BUS_TLM_MODE_10"},{"$f":"VLOOKUP(G5,List!B:G,6,0)","v":2},{"$error":"#REF!"},"0000    CALL dcsm-EF_BUS_TLM_MODE_10 -Run"]
[null,null,{"$error":"#REF!"},{"$f":"C6+H6/3600/24","v":{"$error":"#REF!"}},null,"SI ON","MEA1_ON_SETUP_SW",{"$f":"VLOOKUP(G6,List!B:C,2,0)","v":292},null,null,{"$f":"VLOOKUP(G6,List!B:E,4,0)","v":"dcsm-EF_MEA1_ON_SW"},{"$f":"VLOOKUP(G6,List!B:G,6,0)","v":12},{"$error":"#REF!"},"0000    CALL dcsm-EF_MEA1_ON_SW -Run"]
[null,null,{"$error":"#REF!"},{"$error":"#REF!"},null,null,"HEP_ON_SETUP",{"$f":"VLOOKUP(G7,List!B:C,2,0)","v":1230},null,null,{"$f":"VLOOKUP(G7,List!B:E,4,0)","v":"dcsm-EF_HEP_ON_START_for_TL"},{"$f":"VLOOKUP(G7,List!B:G,6,0)","v":34},{"$error":"#REF!"},"0000    CALL dcsm-EF_HEP_ON_START_for_TL -Run",null,"CALL","dcsm-EF_MDP_CRUISE_SET",null,null,null,"x"]
[null,null,{"$error":"#REF!"},{"$error":"#REF!"},null,null,"PME_ON",{"$f":"VLOOKUP(G8,List!B:C,2,0)","v":80},null,null,{"$f":"VLOOKUP(G8,List!B:E,4,0)","v":"dcsm-EF_PME_ON"},{"$f":"VLOOKUP(G8,List!B:G,6,0)","v":2},{"$error":"#REF!"},"0000    CALL dcsm-EF_PME_ON -Run",null,"CALL","dcsm-EF_BUS_TLM_MODE_10",null,null,null,"x"]
[null,null,{"$error":"#REF!"},{"$error":"#REF!"},null,null,"MGF_ON_SETUP",{"$f":"VLOOKUP(G9,List!B:C,2,0)","v":14},null,null,{"$f":"VLOOKUP(G9,List!B:E,4,0)","v":"dcsm-EF_MGF_ON"},{"$f":"VLOOKUP(G9,List!B:G,6,0)","v":3},{"$error":"#REF!"},"0000    CALL dcsm-EF_MGF_ON -Run"]
[null,null,{"$f":"D9","v":{"$error":"#REF!"}},{"$f":"C10+H10/3600/24","v":{"$error":"#REF!"}},null,null,"ENA_ON_SETUP",{"$f":"VLOOKUP(G10,List!B:C,2,0)","v":564},null,null,{"$f":"VLOOKUP(G10,List!B:E,4,0)","v":"dcsm-EF_ENA_power_ON"},{"$f":"VLOOKUP(G10,List!B:G,6,0)","v":7},{"$f":"C10-317/3600/24","v":{"$error":"#REF!"}},{"$f":"+\"0000    CALL \"&K10&\" -Run\"","v":"0000    CALL dcsm-EF_ENA_power_ON -Run"}]
{"$rows_left_out":1}
{"sheet":"END","index":5,"n_rows":8,"n_cols":21,"rows_kept":8,"cut":false,"hidden":false,"merged":[[1,5,5,5]]}
["Start","End","Start","End","Event","Activity","Procedure","Duration (sec)",null,null,null,"cmd count",null,"cmd count"]
[null,null,{"$f":"D2-H2/3600/24","v":{"$error":"#REF!"}},{"$f":"C3","v":{"$error":"#REF!"}},null,"SI OFF","HEP_OFF",{"$f":"VLOOKUP(G2,List!B:C,2,0)","v":70},null,null,{"$f":"VLOOKUP(G2,List!B:E,4,0)","v":"dcsm-EF_HEPE_OFF_STOP"},{"$f":"VLOOKUP(G2,List!B:G,6,0)","v":4},{"$f":"C2-317/3600/24","v":{"$error":"#REF!"}},{"$f":"+\"0000    CALL \"&K2&\" -Run\"","v":"0000    CALL dcsm-EF_HEPE_OFF_STOP -Run"},null,"CALL","dcsm-EF_HEPE_OFF_STOP",null,null,null,{"$f":"+IF(Q2=K2,\"\",\"x\")","v":""}]
[null,null,{"$error":"#REF!"},{"$error":"#REF!"},null,null,"MEA1_OFF",{"$f":"VLOOKUP(G3,List!B:C,2,0)","v":160},null,null,{"$f":"VLOOKUP(G3,List!B:E,4,0)","v":"dcsm-EF_MEA1_OFF"},{"$f":"VLOOKUP(G3,List!B:G,6,0)","v":4},{"$error":"#REF!"},{"$f":"+\"0000    CALL \"&K3&\" -Run\"","v":"0000    CALL dcsm-EF_MEA1_OFF -Run"},null,"CALL","dcsm-EF_MEA1_OFF",null,null,null,""]
[null,null,{"$error":"#REF!"},{"$error":"#REF!"},null,null,"MGF_OFF",{"$f":"VLOOKUP(G4,List!B:C,2,0)","v":8},null,null,{"$f":"VLOOKUP(G4,List!B:E,4,0)","v":"dcsm-EF_MGF_OFF"},{"$f":"VLOOKUP(G4,List!B:G,6,0)","v":1},{"$error":"#REF!"},"0000    CALL dcsm-EF_MGF_OFF -Run",null,"CALL","dcsm-EF_MGF_OFF",null,null,null,""]
[null,null,{"$error":"#REF!"},{"$error":"#REF!"},null,null,"PME_OFF",{"$f":"VLOOKUP(G5,List!B:C,2,0)","v":40},null,null,{"$f":"VLOOKUP(G5,List!B:E,4,0)","v":"dcsm-EF_PME_OFF"},{"$f":"VLOOKUP(G5,List!B:G,6,0)","v":1},{"$error":"#REF!"},"0000    CALL dcsm-EF_PME_OFF -Run",null,"CALL","dcsm-EF_PME_OFF",null,null,null,""]
[null,null,{"$error":"#REF!"},{"$error":"#REF!"},null,null,"ENA_OFF",{"$f":"VLOOKUP(G6,List!B:C,2,0)","v":88},null,null,{"$f":"VLOOKUP(G6,List!B:E,4,0)","v":"dcsm-EF_ENA_power_OFF"},{"$f":"VLOOKUP(G6,List!B:G,6,0)","v":4},{"$f":"C6-317/3600/24","v":{"$error":"#REF!"}},{"$f":"+\"0000    CALL \"&K6&\" -Run\"","v":"0000    CALL dcsm-EF_ENA_power_OFF -Run"},null,"CALL","dcsm-EF_PME_OFF",null,null,null,{"$f":"+IF(Q6=K6,\"\",\"x\")","v":"x"}]
[null,null,{"$error":"#REF!"},{"$error":"#REF!"},null,"MDP OFF","MDP_OFF_D",{"$f":"VLOOKUP(G7,List!B:C,2,0)","v":120},null,null,{"$f":"VLOOKUP(G7,List!B:E,4,0)","v":"dcsm-EF_MDP_POWEROFF"},{"$f":"VLOOKUP(G7,List!B:G,6,0)","v":3},{"$error":"#REF!"},"0000    CALL dcsm-EF_MDP_POWEROFF -Run",null,null,null,null,null,null,{"$f":"+IF(#REF!=K7,\"\",\"x\")","v":{"$error":"#REF!"}}]
[null,null,{"$f":"#REF!","v":{"$error":"#REF!"}},{"$f":"C8+H8/3600/24","v":{"$error":"#REF!"}},{"$f":"#REF!","v":{"$error":"#REF!"}},null,"END",1200,null,null,{"$f":"VLOOKUP(G8,List!B:E,4,0)","v":{"$error":"#N/A"}},0,{"$error":"#REF!"}]

{"sheet":"LOOP","index":6,"n_rows":11,"n_cols":21,"rows_kept":11,"cut":false,"hidden":false,"merged":[[7,5,9,5],[1,5,3,5]]}
["Start","End","Start","End","Event","Activity","Procedure","Duration (sec)",null,null,null,"cmd count",null,"cmd count"]
[null,null,{"$f":"#REF!","v":{"$error":"#REF!"}},{"$f":"C2+H2/3600/24","v":{"$error":"#REF!"}},null,"SI HV ON","HEP_HV_ON",{"$f":"VLOOKUP(G2,List!B:C,2,0)","v":270},null,null,{"$f":"VLOOKUP(G2,List!B:E,4,0)","v":"dcsm-EF_HEPE_HV_ON_OBS_START"},{"$f":"VLOOKUP(G2,List!B:G,6,0)","v":6},{"$f":"C2-317/3600/24","v":{"$error":"#REF!"}},{"$f":"+\"0000    CALL \"&K2&\" -Run\"","v":"0000    CALL dcsm-EF_HEPE_HV_ON_OBS_START -Run"},null,"CALL","dcsm-EF_MEA1_HV_ON",null,null,null,{"$f":"+IF(Q2=K2,\"\",\"x\")","v":"x"}]
[null,null,{"$f":"D2","v":{"$error":"#REF!"}},{"$error":"#REF!"},null,null,"ENA_HV_ON_CNT",{"$f":"VLOOKUP(G3,List!B:C,2,0)","v":344},null,null,{"$f":"VLOOKUP(G3,List!B:E,4,0)","v":"dcsm-EF_ENA_HV_ON_CNT"},{"$f":"VLOOKUP(G3,List!B:G,6,0)","v":18},{"$error":"#REF!"},{"$f":"+\"0000    CALL \"&K3&\" -Run\"","v":"0000    CALL dcsm-EF_ENA_HV_ON_CNT -Run"},null,"CALL","dcsm-EF_HEPE_HV_ON_OBS_START",null,null,null,"x"]
[null,null,{"$f":"D3","v":{"$error":"#REF!"}},{"$error":"#REF!"},null,null,"MEA1_HV_ON",{"$f":"VLOOKUP(G4,List!B:C,2,0)","v":1702},null,null,{"$f":"VLOOKUP(G4,List!B:E,4,0)","v":"dcsm-EF_MEA1_HV_ON"},{"$f":"VLOOKUP(G4,List!B:G,6,0)","v":27},{"$f":"C4-317/3600/24","v":{"$error":"#REF!"}},{"$f":"+\"0000    CALL \"&K4&\" -Run\"","v":"0000    CALL dcsm-EF_MEA1_HV_ON -Run"},null,"CALL","dcsm-EF_HEPE_HV_ON_OBS_START",null,null,null,{"$f":"+IF(Q4=K4,\"\",\"x\")","v":"x"}]
[null,null,{"$error":"#REF!"},{"$error":"#REF!"},null,"TLM mode change (MODE_5)","TLM_MODE_5",{"$f":"VLOOKUP(G5,List!B:C,2,0)","v":42},null,null,{"$f":"VLOOKUP(G5,List!B:E,4,0)","v":"dcsm-EF_BUS_TLM_MODE_5"},{"$f":"VLOOKUP(G5,List!B:G,6,0)","v":2},{"$error":"#REF!"},"0000    CALL dcsm-EF_BUS_TLM_MODE_5 -Run",null,"CALL","dcsm-EF_BUS_TLM_MODE_5",null,null,null,""]
[null,null,{"$error":"#REF!"},{"$f":"C7","v":{"$error":"#REF!"}},"Observation Q",null,null,{"$f":"(D6-C6)*3600*24","v":{"$error":"#REF!"}},{"$f":"H6/3600","v":{"$error":"#REF!"}},null,null,0,{"$error":"#REF!"},{"$f":"\"0000    WAIT_SEC  \"&TEXT(H6,\"#0\")","v":{"$error":"#REF!"}},null,"WAIT_SEC",26900,null,null,null,"x"]
[null,null,{"$f":"D7-H7/3600/24","v":{"$error":"#REF!"}},{"$f":"C8","v":{"$error":"#REF!"}},null,"TLM mode change (MODE_10)","TLM_MODE_10",{"$f":"VLOOKUP(G7,List!B:C,2,0)","v":42},null,null,{"$f":"VLOOKUP(G7,List!B:E,4,0)","v":"dcsm-EF_BUS_TLM_MODE_10"},{"$f":"VLOOKUP(G7,List!B:G,6,0)","v":2},{"$error":"#REF!"},{"$f":"+\"0000    CALL \"&K7&\" -Run\"","v":"0000    CALL dcsm-EF_BUS_TLM_MODE_10 -Run"},null,"CALL","dcsm-EF_BUS_TLM_MODE_10",null,null,null,""]
[null,null,{"$f":"D8-H8/3600/24","v":{"$error":"#REF!"}},{"$f":"C9","v":{"$error":"#REF!"}},null,"SI HV OFF","HEP_HV_OFF",{"$f":"VLOOKUP(G8,List!B:C,2,0)","v":190},null,null,{"$f":"VLOOKUP(G8,List!B:E,4,0)","v":"dcsm-EF_HEPE_HV_OFF_OBS_OFF"},{"$f":"VLOOKUP(G8,List!B:G,6,0)","v":5},{"$error":"#REF!"},"0000    CALL dcsm-EF_HEPE_HV_OFF_OBS_OFF -Run",null,"CALL","dcsm-EF_HEPE_HV_OFF_OBS_OFF",null,null,null,""]
[null,null,{"$f":"D9-H9/3600/24","v":{"$error":"#REF!"}},{"$f":"C10","v":{"$error":"#REF!"}},null,null,"ENA_HV_OFF",{"$f":"VLOOKUP(G9,List!B:C,2,0)","v":198},null,null,{"$f":"VLOOKUP(G9,List!B:E,4,0)","v":"dcsm-EF_ENA_HV_OFF"},{"$f":"VLOOKUP(G9,List!B:G,6,0)","v":4},{"$f":"C9-317/3600/24","v":{"$error":"#REF!"}},{"$f":"+\"0000    CALL \"&K9&\" -Run\"","v":"0000    CALL dcsm-EF_ENA_HV_OFF -Run"},null,"CALL","dcsm-EF_HEPE_HV_OFF_OBS_OFF",null,null,null,{"$f":"+IF(Q9=K9,\"\",\"x\")","v":"x"}]
[null,null,{"$f":"D10-H10/3600/24","v":{"$error":"#REF!"}},{"$f":"C11","v":{"$error":"#REF!"}},null,null,"MEA1_HV_OFF",{"$f":"VLOOKUP(G10,List!B:C,2,0)","v":182},null,null,{"$f":"VLOOKUP(G10,List!B:E,4,0)","v":"dcsm-EF_MEA1_HV_OFF"},{"$f":"VLOOKUP(G10,List!B:G,6,0)","v":10},{"$error":"#REF!"},"0000    CALL dcsm-EF_MEA1_HV_OFF -Run",null,"CALL","dcsm-EF_MEA1_HV_OFF",null,null,null,""]
{"$rows_left_out":2}
{"sheet":"COMMENT","index":7,"n_rows":24,"n_cols":3,"rows_kept":24,"cut":false,"hidden":false,"merged":[]}
["activity","Comment"]
["main_start","#!HEAD: main2-CROUSE_OBS6_XDOR_001_M63 2021-07-01 01:18:36 478        45 MMO                  MAIN2               // Earth Fly-by                \n0001  . # LET                  @ONERR=NEXT                   \n0002  . # ==========================================================================\n0003    #  <startTime>2021-07-06T08:00:00Z</startTime>\n0004    #  <stopTime>2021-07-15T10:00:00Z</stopTime>\n0005    #  << XDOR:XDOR_BJXR_C%%%_CRCO_M&&&&&&_00001.BC >> 連続送信*****\n0006    #  << XOR:XOR__BJXR_C%%%_CRCO_M&&&&&&_00001.BC >> *****\n0007    # ==========================================================================\n0008    # ==========================================================================\n0009  . #  EXEC_AT 2021-07-06 08:00:00\n0010    # ◆◇◆◇◆◇◆◇◆◇◆◇◆◇◆◇◆◇◆◇◆◇◆◇◆◇◆◇◆◇◆◇◆◇◆◇◆\n0015    # ==========================================================================\n0016    # 0. MMO MOSIF Heater &  Switch to Standby Mode\n0017    # ==========================================================================\n0018    #\n0019    # Change MOSIF Heater Setting   (14sec)\n0020    # <forMPO>AJXF017A</forMPO>     \n0021    WAIT_SEC             20             \n0022    #\n0019    # Change MOSIF R Heater Setting   \n0020    # <forMPO>AJXF017C</forMPO>     \n0021    WAIT_SEC             42580             \n0022    #\n0023    # MMO Switch to Standby Mode (main) (300sec)\n0024    # <forMPO>AJXF001A</forMPO> \n0025    WAIT_SEC             360                   \n0026    #\n0027    # MMO Set HK rate to 64 second  (3sec)\n0028    # <forMPO>AJXF005A</forMPO> \n0029    WAIT_SEC              240                  \n0030    #"]
["main_end","0122    # ==========================================================================                \n0291    #############################################################################"]
["OBS","0068    # ==========================================================================\n0069    # @@. Observation \\\\\n0070    # ==========================================================================\n0071    #"]
["WOL","0217    # ==========================================================================\n0218    # @@. WOL # $$\n0219    # ==========================================================================\n0220    #"]
["BUS_ON","0016    # ==========================================================================\n0017    # @@. BUS ON \n0018    # ==========================================================================\n0019    #"]
["MDP ON","0020    # ==========================================================================\n0021    # @@. MDP ON\n0022    # ==========================================================================\n0023    #"]
["SI Check"]
["MDP OFF","0274    # ==========================================================================\n0275    # @@. MDP OFF\n0276    # ==========================================================================\n0277    #"]
["BUS OFF","0285    # ==========================================================================\n0286    # @@. BUS MONI OFF\n0287    # ==========================================================================\n0288    #"]
{"$rows_left_out":15}
{"sheet":"List","index":8,"n_rows":107,"n_cols":7,"rows_kept":107,"cut":false,"hidden":false,"merged":[[89,0,91,0],[93,0,95,0],[97,0,98,0],[101,0,106,0],[45,0,48,0],[49,0,60,0],[61,0,62,0],[63,0,73,0],[74,0,86,0],[87,0,88,0],[43,0,44,0],[1,0,9,0],[10,0,27,0],[28,0,32,0],[33,0,38,0],[39,0,42,0]]}
[null,null,"Duration (sec)","source filename","filename ",null,"cmdcount"]
["BUS","BUS_CEL_MONI_OFF",40,null,"dcsm-BUS_CEL_MONI_OFF",null,1]
[null,"BUS_CEL_MONI_ON",40,null,"dcsm-BUS_CEL_MONI_ON",null,1]
[null,"BUS_CHG_BEFORE_CHK",0,null,"dcsm-BUS_CHG_BEFORE_CHK",null,0]
[null,"BUS_CHG_EMERGENCY_OFF",86,null,"dcsm-BUS_CHG_Emergency_OFF",null,5]
[null,"BUS_CHG_SET",298,null,"dcsm-BUS_CHG_SET",null,14]
[null,"BUS_CHG_START",82,null,"dcsm-BUS_CHG_START",null,2]
[null,"BUS_CHG_STOP_BAT-EXT",160,null,"dcsm-BUS_CHG_STOP_BAT-EXT",null,4]
[null,"BUS_MMO_OFF",140,null,"dcsm-BUS_MMO_OFF",null,1]
[null,"BUS_MMO_ON",80,null,"dcsm-BUS_MMO_ON",null,2]
{"$rows_left_out":98}
{"sheet":"WOL","index":9,"n_rows":19,"n_cols":5,"rows_kept":19,"cut":false,"hidden":false,"merged":[]}
[null,null,"START　TIME","2022-04-11"]
[null,null,"END　TIME","2022-05-06T05:20:00"]
[null,"ID",null,"date time excel","duration(s)"]
[null,"WOLS","WOL#1","2022-04-12T01:07:11",1200]
[null,"WOLS","WOL#2","2022-04-13T04:30:55",1200]
[null,"WOLS","WOL#3","2022-04-14T06:07:23",1200]
[null,"WOLS","WOL#4","2022-04-15T00:58:02",1200]
[null,"WOLS","WOL#5","2022-04-15T20:05:46",1200]
[null,"WOLS","WOL#6","2022-04-16T17:48:31",1200]
[null,"WOLS","WOL#7","2022-04-17T17:14:35",1200]
{"$rows_left_out":10}
{"sheet":"obs_sequence","index":10,"n_rows":340,"n_cols":19,"rows_kept":340,"cut":false,"hidden":false,"merged":[[174,5,176,5],[150,5,152,5],[154,5,156,5],[160,5,162,5],[164,5,166,5],[170,5,172,5],[124,5,126,5],[130,5,132,5],[134,5,136,5],[140,5,142,5],[144,5,146,5],[100,5,102,5],[104,5,106,5],[110,5,112,5],[114,5,116,5],[120,5,122,5],[74,5,76,5],[80,5,82,5],[84,5,86,5],[90,5,92,5],[94,5,96,5],[50,5,52,5],[54,5,56,5],[60,5,62,5],[64,5,66,5],[70,5,72,5],[3,0,3,1],[3,2,3,3],[9,5,13,5],[14,5,16,5],[20,5,22,5],[24,5,26,5],[30,5,32,5],[34,5,36,5],[40,5,42,5],[44,5,46,5],[180,5,182,5],[183,5,187,5],[190,5,191,5],[193,5,199,5],[200,5,205,5],[209,5,213,5],[215,5,220,5],[224,5,228,5],[230,5,235,5],[239,5,243,5],[245,5,250,5],[254,5,258,5],[259,5,265,5],[267,5,268,5],[270,5,274,5],[275,5,277,5],[281,5,283,5],[285,5,287,5],[291,5,293,5],[295,5,297,5],[325,5,327,5],[331,5,333,5],[335,5,337,5],[301,5,303,5],[305,5,307,5],[311,5,313,5],[315,5,317,5],[321,5,323,5]]}
["START",null,{"$f":"WOL!D1","v":"2022-04-11"},"OBCP START",{"$f":"C1-12*60*60/3600/24","v":"2022-04-10T12:00:00"},null,null,null,null,null,null,"5days"]
["END",null,{"$f":"WOL!D2","v":"2022-05-06T05:20:00"},"OBCP END",{"$f":"C2+(240+120+300)/3600/24","v":"2022-05-06T05:31:00"},"CMD END",{"$f":"C2-100/3600/24","v":"2022-05-06T05:18:20"}]
[]
["Relative time (h)",null,"Absolute time (UTC)",null,null,null,null,null,null,null,null,{"$f":"+SUM(L6:L85)","v":617}]
["Start","End","Start","End","Event","Activity","Procedure","Duration (sec)",null,null,null,"cmd count","XOR Time","cmd count"]
[null,null,"2022-04-11",{"$f":"C6+H6/3600/24","v":"2022-04-11T00:09:37"},null,"BUS_ON","BUS_SETUP_D",{"$f":"VLOOKUP(G6,List!B:C,2,0)","v":577},null,null,{"$f":"VLOOKUP(G6,List!B:E,4,0)","v":"dcsm-EF_BUS_MONI_ON"},{"$f":"VLOOKUP(G6,List!B:G,6,0)","v":20},{"$f":"C6-317/3600/24","v":"2022-04-10T23:54:43"},{"$f":"+\"0000    CALL \"&K6&\" -Run\"","v":"0000    CALL dcsm-EF_BUS_MONI_ON -Run"},null,null,{"$f":"+D6-C6","v":6.6782407375285402E-3},{"$f":"+C7-C6","v":6.6782407375285402E-3},{"$f":"+D7-D6","v":5.8912037056870759E-3}]
[null,null,{"$f":"D6","v":"2022-04-11T00:09:37"},{"$f":"C7+H7/3600/24","v":"2022-04-11T00:18:06"},null,"MDP ON","MDP_ON_D",{"$f":"VLOOKUP(G7,List!B:C,2,0)","v":509},null,null,{"$f":"VLOOKUP(G7,List!B:E,4,0)","v":"dcsm-EF_MDP_ON"},{"$f":"VLOOKUP(G7,List!B:G,6,0)","v":11},"2022-04-11T00:04:20","0000    CALL dcsm-EF_MDP_ON -Run",null,null,{"$f":"+D7-C7","v":5.8912037056870759E-3},{"$f":"+C8-C7","v":5.8912037056870759E-3},4.8611110833007842E-4]
[null,null,{"$f":"D7","v":"2022-04-11T00:18:06"},{"$f":"C8+H8/3600/24","v":"2022-04-11T00:18:48"},null,null,"MDP_CRUISE_SET",{"$f":"VLOOKUP(G8,List!B:C,2,0)","v":42},null,null,{"$f":"VLOOKUP(G8,List!B:E,4,0)","v":"dcsm-EF_MDP_CRUISE_SET"},{"$f":"VLOOKUP(G8,List!B:G,6,0)","v":2},"2022-04-11T00:12:49","0000    CALL dcsm-EF_MDP_CRUISE_SET -Run",null,null,4.8611110833007842E-4,4.8611110833007842E-4,4.8611110833007842E-4]
[null,null,"2022-04-11T00:18:48","2022-04-11T00:19:30",null,"TLM mode change (MODE_10)","TLM_MODE_10",{"$f":"VLOOKUP(G9,List!B:C,2,0)","v":42},null,null,{"$f":"VLOOKUP(G9,List!B:E,4,0)","v":"dcsm-EF_BUS_TLM_MODE_10"},{"$f":"VLOOKUP(G9,List!B:G,6,0)","v":2},"2022-04-11T00:13:31","0000    CALL dcsm-EF_BUS_TLM_MODE_10 -Run",null,null,4.8611110833007842E-4,4.8611110833007842E-4,3.379629626579117E-3]
[null,null,"2022-04-11T00:19:30","2022-04-11T00:24:22",null,"SI ON","MEA1_ON_SETUP_SW",{"$f":"VLOOKUP(G10,List!B:C,2,0)","v":292},null,null,{"$f":"VLOOKUP(G10,List!B:E,4,0)","v":"dcsm-EF_MEA1_ON_SW"},{"$f":"VLOOKUP(G10,List!B:G,6,0)","v":12},"2022-04-11T00:14:13","0000    CALL dcsm-EF_MEA1_ON_SW -Run",null,null,3.379629626579117E-3,3.379629626579117E-3,1.4236111113859806E-2]
{"$rows_left_out":330}