{"text_format":"1","workbook":"xlsx","n_sheets":11,"sheets":["確認事項","変更履歴","実行","チェック表","START","END","LOOP","COMMENT","List","WOL","obs_sequence"],"not_rendered":{"charts":0,"images":0,"macros":1,"external_links":0,"defined_names":7,"comments":0,"pivot_tables":0},"unopened":[],"bounds":{"document_bytes":16777216,"sheet_cells":100000,"rows_first":2000,"rows_last":500,"rows_between":2000,"halvings":0,"cell_chars":16384,"cell_head_chars":4096},"cells_cut":0,"cells_raw":0,"read":"whole","date_system":"1900"}

{"sheet":"確認事項","index":0,"n_rows":1,"n_cols":4,"rows_kept":1,"cut":false,"hidden":false,"merged":[]}
["NO.","確認事項","回答","CLOSE"]

{"sheet":"変更履歴","index":1,"n_rows":11,"n_cols":4,"rows_kept":11,"cut":false,"hidden":false,"merged":[[0,0,0,3]]}
["MMO観測計画作成ツール　変更履歴"]
["日付","Ver","変更者","変更内容"]
["2021-08-06",1,"山下","-"]
["2021-08-09",2,"arare","コマンド出力のmain　end部分を出力するように修正した\nListにMSA_HV_ON_VFB1、MSA_HV_ON_VFB2追加\nObs_sequence XOR Time行追記\nコマンドの開始終了時間をOBS時間に変更"]
["2021-08-17",3,"arare","WOLの時間をG列から取得するように変更"]
["2021-08-25",4,"arare","COMMENTにmainstart,endのXDOR,XOR用追記"]
["2021-09-27",5,"arare","＃refの対応 obserbation Aから昇順につける"]
["2021-10-19",6,"arare","ListにMSAHV追記"]
["2021-10-21",7,"arare","Listを最新にした"]
["2022-03-08",8,"arare","Listを最新にした、XDOR用コメントはプログラム改修により使用なし"]
["2022-03-23",9,"arare","List にENA HV ON追加、コメントの修正"]

{"sheet":"実行","index":2,"n_rows":16,"n_cols":6,"rows_kept":16,"cut":false,"hidden":false,"merged":[]}
[]
[]
[]
[]
[]
[]
[]
[null,null,null,null,null,"【操作】"]
["C番号",10,null,null,null,"「実行」シートの「観測作成」を押下。"]
["M番号",631205,null,null,null,"→「START」、「LOOP」、「END」を「obs_sequence」に貼り付けます。"]
[null,null,null,null,null,"「実行」シートの「時刻反映」を押下。"]
[null,null,null,null,null,"→WOLの時間と関数エラーとなっているセルを修正します。"]
[null,null,null,null,null,"【注意点】"]
[null,null,null,null,null,"「START」、「LOOP」、「END」の\"cmd count\"からシート内に何行あるかを取得しているので、ここは空白がないように\"0”を入力してください。"]
[null,null,null,null,null,"もし空白があった場合、コピー範囲が小さくなってしまいます。"]
[null,null,null,null,null,"”WOL”シートの4行目以下は、実施するWOLのみを記載すること。\n(4行目以下に、期間開始日時と終了日時の記載は不要です。)"]

{"sheet":"チェック表","index":3,"n_rows":19,"n_cols":4,"rows_kept":19,"cut":false,"hidden":true,"merged":[]}
[]
[null,"コマンド作成時注意項目"]
[null,"NO.","項目","チェック"]
[null,1,"\n観測期間開始時に「dcsm-EF_BUS_MONI_ON」手順が入っていることを確認する。\nただし、前回の観測終了時に「dcsm-EF_BUS_MONI_OFF」を実行していない場合は確認不要。\n","□"]
[null,2,"\n観測期間開始日に、観測する機器の”ON”手順が入っていることを確認する。\nただし、PWI、MGF、MAST、WPTを\"ON\"にする場合は、PWI、MGF、MAST、WPTよりも先にPMEが\"ON\"となっていること。\n※クルーズ観測中は、MEA1,HEPE,MGFのみ”ON”\n","□"]
[null,3,"\nTLM MODEが観測前に「５」　観測終了後は「１０」　となっていることを確認する\n","□"]
[null,4,"\n観測時間が”86400”を超えるていないか確認する。\n超えていた場合は、main計画作成時に途中ダミーコマンドを挿入すること\n"]
[null,5,"WOLの開始時刻が正しいことを確認する","□"]
[null,6,"\nWOLの時間を確認　HV　OFFになっていることを確認する\n↓\nクルーズ観測を行っている機器(HEPE、ENA、MIA、MEA、MSAのみ)\nフライバイを行っている機器(MSA,PWI,MGF,MEA,ENA,MIA,HEPE,MDM)\n","□"]
[null,7,"\nWOL終了時刻＋10以降にのHVがONになっていることを確認する。\nクルーズ観測を行っている機器(HEPE、ENA、MIA、MEA、MSAのみ)\nフライバイを行っている機器(MSA,PWI,MGF,MEA,ENA,MIA,HEPE,MDM)\n","□"]
[null,8,"\n観測期間最終日に、観測を行った機器の”OFF”手順が入っていることを確認する。\nただし、PWI,MGF,MAST,WPT-OFF手順の後にPME-OFF手順が入っていることを確認する。\n","□"]
[null,9,"\nMDP_POWEROFFのあとにdcsm-MC_ENA_MDPが入っていることを確認する。\n","□"]
[null,10,"\nCELのMONI ONは長時間(1h以上の場合は、山下さんと要相談)しないこと　\nBUSにはCELのみのもあるので注意　dcsm-BUS_CEL_MONI_ON　dcsm-BUS_CEL_MONI_OFF\n","□"]
[null,11,"MEA1の  SCAN ON は　dcsm-EF_MEA1_ON_SW.cpsに入っているので\n　　　順番は　MDP ONして\n　　　　　　　dcsm-EF_MEA1_ON_SW.cps\n　　　　　　　dcsm-EF_MEA1_HV_ON.cps\n　　　　　　　dcsm-EF_MEA1_HV_OFF.cps\n　　　　　　　dcsm-EF_MEA1_HV_ON.cps\n　　　　　　　dcsm-EF_MEA1_HV_SCAN_OFF.cps\n　　　　　　　dcsm-EF_MEA1_OFF.cps\n　　　　　　　MDP　OFF\n　　　　　　　\n  　　　　　　dcsm-EF_MEA_ON_SW.cps\n　　　　　　　dcsm-EF_MEA_HV_ON.cps\n　　　　　　　dcsm-EF_MEA_HV_OFF.cps\n　　　　　　　dcsm-EF_MEA_HV_ON.cps\n　　　　　　　dcsm-EF_MEA_HV_SCAN_OFF.cps\n　　　　　　　dcsm-EF_MEA_OFF.cps\n\n　　　になる\n　SCAN OFFにすると　データが出てこない　HV OFF->ON時は注意する","□"]
[null,13,"2021/6/25以降　dcsm-EF_MSA_ON_C　が最新　dcsm-EF_MSA_ONは使用しない","□"]
[null,14,"2021/6/25以降　dcsm-CRCO_MIA_CHECK_C　が最新　dcsm-CRCO_MIA_CHECKは使用しない（クルーズチェックアウトの時）","□"]
[null,15,"2021/6/25以降　dcsm-CRCO_MSA_CHECK_C　が最新　dcsm-CRCO_MSA_CHECKは使用しない（クルーズチェックアウトの時）","□"]
[null,16,"フライバイ時、MIAのHV_ON時間帯によって違うので必ず確認する\nMIA_HV_ON_RC\nMIA_HV_ON_SW_RC\nMIA_HV_ON_MAG_RC","□"]
[null,17,"Excelの時間を確認する　時間通りになっているか","□"]

{"sheet":"START","index":4,"n_rows":10,"n_cols":21,"rows_kept":10,"cut":false,"hidden":false,"merged":[[5,5,9,5]]}
["Start","End","Start","End","Event","Activity","Procedure","Duration (sec)",null,null,null,"cmd count",null,"cmd count"]
[null,null,{"$f":"#REF!","v":{"$error":"#REF!"}},{"$f":"C2+H2/3600/24","v":{"$error":"#REF!"}},null,"BUS_ON","BUS_SETUP_D",{"$f":"VLOOKUP(G2,List!B:C,2,0)","v":577},null,null,{"$f":"VLOOKUP(G2,List!B:E,4,0)","v":"dcsm-EF_BUS_MONI_ON"},{"$f":"VLOOKUP(G2,List!B:G,6,0)","v":20},{"$f":"C2-317/3600/24","v":{"$error":"#REF!"}},{"$f":"+\"0000    CALL \"&K2&\" -Run\"","v":"0000    CALL dcsm-EF_BUS_MONI_ON -Run"},null,"CALL","dcsm-EF_BUS_MONI_ON",null,null,null,{"$f":"+IF(Q2=K2,\"\",\"x\")","v":""}]
[null,null,{"$f":"D2","v":{"$error":"#REF!"}},{"$f":"C3+H3/3600/24","v":{"$error":"#REF!"}},null,"MDP ON","MDP_ON_D",{"$f":"VLOOKUP(G3,List!B:C,2,0)","v":509},null,null,{"$f":"VLOOKUP(G3,List!B:E,4,0)","v":"dcsm-EF_MDP_ON"},{"$f":"VLOOKUP(G3,List!B:G,6,0)","v":11},{"$error":"#REF!"},"0000    CALL dcsm-EF_MDP_ON -Run",null,"CALL","dcsm-EF_MDP_ON",null,null,null,{"$f":"+IF(Q3=K3,\"\",\"x\")","v":""}]
[null,null,{"$f":"D3","v":{"$error":"#REF!"}},{"$f":"C4+H4/3600/24","v":{"$error":"#REF!"}},null,null,"MDP_CRUISE_SET",{"$f":"VLOOKUP(G4,List!B:C,2,0)","v":42},null,null,{"$f":"VLOOKUP(G4,List!B:E,4,0)","v":"dcsm-EF_MDP_CRUISE_SET"},{"$f":"VLOOKUP(G4,List!B:G,6,0)","v":2},{"$error":"#REF!"},"0000    CALL dcsm-EF_MDP_CRUISE_SET -Run"]
[null,null,{"$error":"#REF!"},{"$error":"#REF!"},null,"TLM mode change (MODE_10)","TLM_MODE_10",{"$f":"VLOOKUP(G5,List!B:C,2,0)","v":42},null,null,{"$f":"VLOOKUP(G5,List!B:E,4,0)","v":"dcsm-EF_BUS_TLM_MODE_10"},{"$f":"VLOOKUP(G5,List!B:G,6,0)","v":2},{"$error":"#REF!"},"0000    CALL dcsm-EF_BUS_TLM_MODE_10 -Run"]
[null,null,{"$error":"#REF!"},{"$f":"C6+H6/3600/24","v":{"$error":"#REF!"}},null,"SI ON","MEA1_ON_SETUP_SW",{"$f":"VLOOKUP(G6,List!B:C,2,0)","v":292},null,null,{"$f":"VLOOKUP(G6,List!B:E,4,0)","v":"dcsm-EF_MEA1_ON_SW"},{"$f":"VLOOKUP(G6,List!B:G,6,0)","v":12},{"$error":"#REF!"},"0000    CALL dcsm-EF_MEA1_ON_SW -Run"]
[null,null,{"$error":"#REF!"},{"$error":"#REF!"},null,null,"HEP_ON_SETUP",{"$f":"VLOOKUP(G7,List!B:C,2,0)","v":1230},null,null,{"$f":"VLOOKUP(G7,List!B:E,4,0)","v":"dcsm-EF_HEP_ON_START_for_TL"},{"$f":"VLOOKUP(G7,List!B:G,6,0)","v":34},{"$error":"#REF!"},"0000    CALL dcsm-EF_HEP_ON_START_for_TL -Run",null,"CALL","dcsm-EF_MDP_CRUISE_SET",null,null,null,"x"]
[null,null,{"$error":"#REF!"},{"$error":"#REF!"},null,null,"PME_ON",{"$f":"VLOOKUP(G8,List!B:C,2,0)","v":80},null,null,{"$f":"VLOOKUP(G8,List!B:E,4,0)","v":"dcsm-EF_PME_ON"},{"$f":"VLOOKUP(G8,List!B:G,6,0)","v":2},{"$error":"#REF!"},"0000    CALL dcsm-EF_PME_ON -Run",null,"CALL","dcsm-EF_BUS_TLM_MODE_10",null,null,null,"x"]
[null,null,{"$error":"#REF!"},{"$error":"#REF!"},null,null,"MGF_ON_SETUP",{"$f":"VLOOKUP(G9,List!B:C,2,0)","v":14},null,null,{"$f":"VLOOKUP(G9,List!B:E,4,0)","v":"dcsm-EF_MGF_ON"},{"$f":"VLOOKUP(G9,List!B:G,6,0)","v":3},{"$error":"#REF!"},"0000    CALL dcsm-EF_MGF_ON -Run"]
[null,null,{"$f":"D9","v":{"$error":"#REF!"}},{"$f":"C10+H10/3600/24","v":{"$error":"#REF!"}},null,null,"ENA_ON_SETUP",{"$f":"VLOOKUP(G10,List!B:C,2,0)","v":564},null,null,{"$f":"VLOOKUP(G10,List!B:E,4,0)","v":"dcsm-EF_ENA_power_ON"},{"$f":"VLOOKUP(G10,List!B:G,6,0)","v":7},{"$f":"C10-317/3600/24","v":{"$error":"#REF!"}},{"$f":"+\"0000    CALL \"&K10&\" -Run\"","v":"0000    CALL dcsm-EF_ENA_power_ON -Run"}]

{"sheet":"END","index":5,"n_rows":8,"n_cols":21,"rows_kept":8,"cut":false,"hidden":false,"merged":[[1,5,5,5]]}
["Start","End","Start","End","Event","Activity","Procedure","Duration (sec)",null,null,null,"cmd count",null,"cmd count"]
[null,null,{"$f":"D2-H2/3600/24","v":{"$error":"#REF!"}},{"$f":"C3","v":{"$error":"#REF!"}},null,"SI OFF","HEP_OFF",{"$f":"VLOOKUP(G2,List!B:C,2,0)","v":70},null,null,{"$f":"VLOOKUP(G2,List!B:E,4,0)","v":"dcsm-EF_HEPE_OFF_STOP"},{"$f":"VLOOKUP(G2,List!B:G,6,0)","v":4},{"$f":"C2-317/3600/24","v":{"$error":"#REF!"}},{"$f":"+\"0000    CALL \"&K2&\" -Run\"","v":"0000    CALL dcsm-EF_HEPE_OFF_STOP -Run"},null,"CALL","dcsm-EF_HEPE_OFF_STOP",null,null,null,{"$f":"+IF(Q2=K2,\"\",\"x\")","v":""}]
[null,null,{"$error":"#REF!"},{"$error":"#REF!"},null,null,"MEA1_OFF",{"$f":"VLOOKUP(G3,List!B:C,2,0)","v":160},null,null,{"$f":"VLOOKUP(G3,List!B:E,4,0)","v":"dcsm-EF_MEA1_OFF"},{"$f":"VLOOKUP(G3,List!B:G,6,0)","v":4},{"$error":"#REF!"},{"$f":"+\"0000    CALL \"&K3&\" -Run\"","v":"0000    CALL dcsm-EF_MEA1_OFF -Run"},null,"CALL","dcsm-EF_MEA1_OFF",null,null,null,""]
[null,null,{"$error":"#REF!"},{"$error":"#REF!"},null,null,"MGF_OFF",{"$f":"VLOOKUP(G4,List!B:C,2,0)","v":8},null,null,{"$f":"VLOOKUP(G4,List!B:E,4,0)","v":"dcsm-EF_MGF_OFF"},{"$f":"VLOOKUP(G4,List!B:G,6,0)","v":1},{"$error":"#REF!"},"0000    CALL dcsm-EF_MGF_OFF -Run",null,"CALL","dcsm-EF_MGF_OFF",null,null,null,""]
[null,null,{"$error":"#REF!"},{"$error":"#REF!"},null,null,"PME_OFF",{"$f":"VLOOKUP(G5,List!B:C,2,0)","v":40},null,null,{"$f":"VLOOKUP(G5,List!B:E,4,0)","v":"dcsm-EF_PME_OFF"},{"$f":"VLOOKUP(G5,List!B:G,6,0)","v":1},{"$error":"#REF!"},"0000    CALL dcsm-EF_PME_OFF -Run",null,"CALL","dcsm-EF_PME_OFF",null,null,null,""]
[null,null,{"$error":"#REF!"},{"$error":"#REF!"},null,null,"ENA_OFF",{"$f":"VLOOKUP(G6,List!B:C,2,0)","v":88},null,null,{"$f":"VLOOKUP(G6,List!B:E,4,0)","v":"dcsm-EF_ENA_power_OFF"},{"$f":"VLOOKUP(G6,List!B:G,6,0)","v":4},{"$f":"C6-317/3600/24","v":{"$error":"#REF!"}},{"$f":"+\"0000    CALL \"&K6&\" -Run\"","v":"0000    CALL dcsm-EF_ENA_power_OFF -Run"},null,"CALL","dcsm-EF_PME_OFF",null,null,null,{"$f":"+IF(Q6=K6,\"\",\"x\")","v":"x"}]
[null,null,{"$error":"#REF!"},{"$error":"#REF!"},null,"MDP OFF","MDP_OFF_D",{"$f":"VLOOKUP(G7,List!B:C,2,0)","v":120},null,null,{"$f":"VLOOKUP(G7,List!B:E,4,0)","v":"dcsm-EF_MDP_POWEROFF"},{"$f":"VLOOKUP(G7,List!B:G,6,0)","v":3},{"$error":"#REF!"},"0000    CALL dcsm-EF_MDP_POWEROFF -Run",null,null,null,null,null,null,{"$f":"+IF(#REF!=K7,\"\",\"x\")","v":{"$error":"#REF!"}}]
[null,null,{"$f":"#REF!","v":{"$error":"#REF!"}},{"$f":"C8+H8/3600/24","v":{"$error":"#REF!"}},{"$f":"#REF!","v":{"$error":"#REF!"}},null,"END",1200,null,null,{"$f":"VLOOKUP(G8,List!B:E,4,0)","v":{"$error":"#N/A"}},0,{"$error":"#REF!"}]

{"sheet":"LOOP","index":6,"n_rows":11,"n_cols":21,"rows_kept":11,"cut":false,"hidden":false,"merged":[[7,5,9,5],[1,5,3,5]]}
["Start","End","Start","End","Event","Activity","Procedure","Duration (sec)",null,null,null,"cmd count",null,"cmd count"]
[null,null,{"$f":"#REF!","v":{"$error":"#REF!"}},{"$f":"C2+H2/3600/24","v":{"$error":"#REF!"}},null,"SI HV ON","HEP_HV_ON",{"$f":"VLOOKUP(G2,List!B:C,2,0)","v":270},null,null,{"$f":"VLOOKUP(G2,List!B:E,4,0)","v":"dcsm-EF_HEPE_HV_ON_OBS_START"},{"$f":"VLOOKUP(G2,List!B:G,6,0)","v":6},{"$f":"C2-317/3600/24","v":{"$error":"#REF!"}},{"$f":"+\"0000    CALL \"&K2&\" -Run\"","v":"0000    CALL dcsm-EF_HEPE_HV_ON_OBS_START -Run"},null,"CALL","dcsm-EF_MEA1_HV_ON",null,null,null,{"$f":"+IF(Q2=K2,\"\",\"x\")","v":"x"}]
[null,null,{"$f":"D2","v":{"$error":"#REF!"}},{"$error":"#REF!"},null,null,"ENA_HV_ON_CNT",{"$f":"VLOOKUP(G3,List!B:C,2,0)","v":344},null,null,{"$f":"VLOOKUP(G3,List!B:E,4,0)","v":"dcsm-EF_ENA_HV_ON_CNT"},{"$f":"VLOOKUP(G3,List!B:G,6,0)","v":18},{"$error":"#REF!"},{"$f":"+\"0000    CALL \"&K3&\" -Run\"","v":"0000    CALL dcsm-EF_ENA_HV_ON_CNT -Run"},null,"CALL","dcsm-EF_HEPE_HV_ON_OBS_START",null,null,null,"x"]
[null,null,{"$f":"D3","v":{"$error":"#REF!"}},{"$error":"#REF!"},null,null,"MEA1_HV_ON",{"$f":"VLOOKUP(G4,List!B:C,2,0)","v":1702},null,null,{"$f":"VLOOKUP(G4,List!B:E,4,0)","v":"dcsm-EF_MEA1_HV_ON"},{"$f":"VLOOKUP(G4,List!B:G,6,0)","v":27},{"$f":"C4-317/3600/24","v":{"$error":"#REF!"}},{"$f":"+\"0000    CALL \"&K4&\" -Run\"","v":"0000    CALL dcsm-EF_MEA1_HV_ON -Run"},null,"CALL","dcsm-EF_HEPE_HV_ON_OBS_START",null,null,null,{"$f":"+IF(Q4=K4,\"\",\"x\")","v":"x"}]
[null,null,{"$error":"#REF!"},{"$error":"#REF!"},null,"TLM mode change (MODE_5)","TLM_MODE_5",{"$f":"VLOOKUP(G5,List!B:C,2,0)","v":42},null,null,{"$f":"VLOOKUP(G5,List!B:E,4,0)","v":"dcsm-EF_BUS_TLM_MODE_5"},{"$f":"VLOOKUP(G5,List!B:G,6,0)","v":2},{"$error":"#REF!"},"0000    CALL dcsm-EF_BUS_TLM_MODE_5 -Run",null,"CALL","dcsm-EF_BUS_TLM_MODE_5",null,null,null,""]
[null,null,{"$error":"#REF!"},{"$f":"C7","v":{"$error":"#REF!"}},"Observation Q",null,null,{"$f":"(D6-C6)*3600*24","v":{"$error":"#REF!"}},{"$f":"H6/3600","v":{"$error":"#REF!"}},null,null,0,{"$error":"#REF!"},{"$f":"\"0000    WAIT_SEC  \"&TEXT(H6,\"#0\")","v":{"$error":"#REF!"}},null,"WAIT_SEC",26900,null,null,null,"x"]
[null,null,{"$f":"D7-H7/3600/24","v":{"$error":"#REF!"}},{"$f":"C8","v":{"$error":"#REF!"}},null,"TLM mode change (MODE_10)","TLM_MODE_10",{"$f":"VLOOKUP(G7,List!B:C,2,0)","v":42},null,null,{"$f":"VLOOKUP(G7,List!B:E,4,0)","v":"dcsm-EF_BUS_TLM_MODE_10"},{"$f":"VLOOKUP(G7,List!B:G,6,0)","v":2},{"$error":"#REF!"},{"$f":"+\"0000    CALL \"&K7&\" -Run\"","v":"0000    CALL dcsm-EF_BUS_TLM_MODE_10 -Run"},null,"CALL","dcsm-EF_BUS_TLM_MODE_10",null,null,null,""]
[null,null,{"$f":"D8-H8/3600/24","v":{"$error":"#REF!"}},{"$f":"C9","v":{"$error":"#REF!"}},null,"SI HV OFF","HEP_HV_OFF",{"$f":"VLOOKUP(G8,List!B:C,2,0)","v":190},null,null,{"$f":"VLOOKUP(G8,List!B:E,4,0)","v":"dcsm-EF_HEPE_HV_OFF_OBS_OFF"},{"$f":"VLOOKUP(G8,List!B:G,6,0)","v":5},{"$error":"#REF!"},"0000    CALL dcsm-EF_HEPE_HV_OFF_OBS_OFF -Run",null,"CALL","dcsm-EF_HEPE_HV_OFF_OBS_OFF",null,null,null,""]
[null,null,{"$f":"D9-H9/3600/24","v":{"$error":"#REF!"}},{"$f":"C10","v":{"$error":"#REF!"}},null,null,"ENA_HV_OFF",{"$f":"VLOOKUP(G9,List!B:C,2,0)","v":198},null,null,{"$f":"VLOOKUP(G9,List!B:E,4,0)","v":"dcsm-EF_ENA_HV_OFF"},{"$f":"VLOOKUP(G9,List!B:G,6,0)","v":4},{"$f":"C9-317/3600/24","v":{"$error":"#REF!"}},{"$f":"+\"0000    CALL \"&K9&\" -Run\"","v":"0000    CALL dcsm-EF_ENA_HV_OFF -Run"},null,"CALL","dcsm-EF_HEPE_HV_OFF_OBS_OFF",null,null,null,{"$f":"+IF(Q9=K9,\"\",\"x\")","v":"x"}]
[null,null,{"$f":"D10-H10/3600/24","v":{"$error":"#REF!"}},{"$f":"C11","v":{"$error":"#REF!"}},null,null,"MEA1_HV_OFF",{"$f":"VLOOKUP(G10,List!B:C,2,0)","v":182},null,null,{"$f":"VLOOKUP(G10,List!B:E,4,0)","v":"dcsm-EF_MEA1_HV_OFF"},{"$f":"VLOOKUP(G10,List!B:G,6,0)","v":10},{"$error":"#REF!"},"0000    CALL dcsm-EF_MEA1_HV_OFF -Run",null,"CALL","dcsm-EF_MEA1_HV_OFF",null,null,null,""]
[null,null,{"$f":"#REF!","v":{"$error":"#REF!"}},{"$f":"C11+H11/3600/24","v":{"$error":"#REF!"}},"WOL",null,{"$f":"(#REF!-D10)*24*3600","v":{"$error":"#REF!"}},1200,null,null,{"$f":"VLOOKUP(G11,#REF!,4,0)","v":{"$error":"#REF!"}},0,{"$error":"#REF!"},{"$f":"\"0000    WAIT_SEC  \"&TEXT(G11,\"#0\")","v":{"$error":"#REF!"}},null,"WAIT_SEC",1800,null,null,null,{"$error":"#REF!"}]

{"sheet":"COMMENT","index":7,"n_rows":24,"n_cols":3,"rows_kept":24,"cut":false,"hidden":false,"merged":[]}
["activity","Comment"]
["main_start","#!HEAD: main2-CROUSE_OBS6_XDOR_001_M63 2021-07-01 01:18:36 478        45 MMO                  MAIN2               // Earth Fly-by                \n0001  . # LET                  @ONERR=NEXT                   \n0002  . # ==========================================================================\n0003    #  <startTime>2021-07-06T08:00:00Z</startTime>\n0004    #  <stopTime>2021-07-15T10:00:00Z</stopTime>\n0005    #  << XDOR:XDOR_BJXR_C%%%_CRCO_M&&&&&&_00001.BC >> 連続送信*****\n0006    #  << XOR:XOR__BJXR_C%%%_CRCO_M&&&&&&_00001.BC >> *****\n0007    # ==========================================================================\n0008    # ==========================================================================\n0009  . #  EXEC_AT 2021-07-06 08:00:00\n0010    # ◆◇◆◇◆◇◆◇◆◇◆◇◆◇◆◇◆◇◆◇◆◇◆◇◆◇◆◇◆◇◆◇◆◇◆◇◆\n0015    # ==========================================================================\n0016    # 0. MMO MOSIF Heater &  Switch to Standby Mode\n0017    # ==========================================================================\n0018    #\n0019    # Change MOSIF Heater Setting   (14sec)\n0020    # <forMPO>AJXF017A</forMPO>     \n0021    WAIT_SEC             20             \n0022    #\n0019    # Change MOSIF R Heater Setting   \n0020    # <forMPO>AJXF017C</forMPO>     \n0021    WAIT_SEC             42580             \n0022    #\n0023    # MMO Switch to Standby Mode (main) (300sec)\n0024    # <forMPO>AJXF001A</forMPO> \n0025    WAIT_SEC             360                   \n0026    #\n0027    # MMO Set HK rate to 64 second  (3sec)\n0028    # <forMPO>AJXF005A</forMPO> \n0029    WAIT_SEC              240                  \n0030    #"]
["main_end","0122    # ==========================================================================                \n0291    #############################################################################"]
["OBS","0068    # ==========================================================================\n0069    # @@. Observation \\\\\n0070    # ==========================================================================\n0071    #"]
["WOL","0217    # ==========================================================================\n0218    # @@. WOL # $$\n0219    # ==========================================================================\n0220    #"]
["BUS_ON","0016    # ==========================================================================\n0017    # @@. BUS ON \n0018    # ==========================================================================\n0019    #"]
["MDP ON","0020    # ==========================================================================\n0021    # @@. MDP ON\n0022    # ==========================================================================\n0023    #"]
["SI Check"]
["MDP OFF","0274    # ==========================================================================\n0275    # @@. MDP OFF\n0276    # ==========================================================================\n0277    #"]
["BUS OFF","0285    # ==========================================================================\n0286    # @@. BUS MONI OFF\n0287    # ==========================================================================\n0288    #"]
["SI ON","0034    # ==========================================================================\n0035    # @@.  PI POWER ON\n0036    # ==========================================================================\n0037    #"]
["SI HV ON","0049    # ==========================================================================\n0050    # @@.  PI HV ON\n0051    # ==========================================================================\n0052    #"]
["TLM mode change (MODE_5)","0059    # ==========================================================================\n0060    # @@. TLM MODE 5  (Mission: 7kbps, without user HK)\n0061    # ==========================================================================\n0062    #"]
["TLM mode change (MODE_10)","0028    # ==========================================================================\n0029    # @@. TLM MODE 10 (Mission: 4kbps, with user HK)\n0030    # ==========================================================================\n0031    #"]
["SI HV OFF","0207    # ==========================================================================\n0208    # @@. PI HV OFF\n0209    # ==========================================================================\n0210    #"]
["SI OFF","0259    # ==========================================================================\n0260    # @@. PI Power OFF\n0261    # ==========================================================================\n0262    #"]
["MSA SOFT RESET"]
["MACRO COMMAND ENA","0280    # ==========================================================================\n0281    # @@. MACRO ENA \n0282    # ==========================================================================\n0283    #"]
["CrouseCheckOut"]
[]
["main_start(XDOR) 改修により使用不可","#!HEAD: main2-CROUSE_OBS6_XDOR_001_M63 2021-07-01 01:18:36 478        45 MMO                  MAIN2               // Earth Fly-by                \n0001  . # LET                  @ONERR=NEXT                   \n0002  . # ==========================================================================\n0003    #  <startTime>2021-07-06T08:00:00Z</startTime>\n0004    #  <stopTime>2021-07-15T10:00:00Z</stopTime>\n0005    #  << XDOR:XDOR_BJXR_C%%%_CRCO_M&&&&&&_00001.BC >> 連続送信*****\n0006    #  << XOR:XOR__BJXR_C%%%_CRCO_M&&&&&&_00001.BC >> *****\n0007    # ==========================================================================\n0008    # ==========================================================================\n0009  . #  EXEC_AT 2021-07-06 08:00:00\n0010    # ◆◇◆◇◆◇◆◇◆◇◆◇◆◇◆◇◆◇◆◇◆◇◆◇◆◇◆◇◆◇◆◇◆◇◆◇◆\n0015    # ==========================================================================\n0016    # 0. MMO MOSIF Heater &  Switch to Standby Mode\n0017    # ==========================================================================\n0018    #\n0019    # Change MOSIF Heater Setting   (14sec)\n0020    # <forMPO>AJXF017A</forMPO>     \n0021    WAIT_SEC             42586                \n0022    #\n0023    # MMO Switch to Standby Mode (main) (300sec)\n0024    # <forMPO>AJXF001A</forMPO> \n0025    WAIT_SEC             60                   \n0026    #\n0027    # MMO Set HK rate to 64 second  (3sec)\n0028    # <forMPO>AJXF005A</forMPO> \n0029    WAIT_SEC              237                  \n0030    #","仕様変更により使用しない"]
["main_start(XOR)","#!HEAD: main2-CROUSE_OBS6_XDOR_001_M63 2021-07-01 01:18:36 478        45 MMO                  MAIN2               // Earth Fly-by                \n0001  . # LET                  @ONERR=NEXT                   \n0002  . # ==========================================================================\n0003    #  <startTime>2021-07-06T08:00:00Z</startTime>\n0004    #  <stopTime>2021-07-15T10:00:00Z</stopTime>\n0005    #  << XDOR:XDOR_BJXR_C%%%_CRCO_M&&&&&&_00001.BC >> 連続送信*****\n0006    #  << XOR:XOR__BJXR_C%%%_CRCO_M&&&&&&_00001.BC >> *****\n0007    # ==========================================================================\n0008    # ==========================================================================\n0009  . #  EXEC_AT 2021-07-06 08:00:00\n0010    # ◆◇◆◇◆◇◆◇◆◇◆◇◆◇◆◇◆◇◆◇◆◇◆◇◆◇◆◇◆◇◆◇◆◇◆◇◆\n0015    # ==========================================================================\n0016    # 0. MMO MOSIF Heater &  Switch to Standby Mode\n0017    # ==========================================================================\n0018    #\n0019    # Change MOSIF Heater Setting   (14sec)\n0020    # <forMPO>AJXF017A</forMPO>     \n0021    WAIT_SEC             42600             \n0022    #\n0023    # MMO Switch to Standby Mode (main) (300sec)\n0024    # <forMPO>AJXF001A</forMPO> \n0025    WAIT_SEC             360                   \n0026    #\n0027    # MMO Set HK rate to 64 second  (3sec)\n0028    # <forMPO>AJXF005A</forMPO> \n0029    WAIT_SEC              240                  \n0030    #"]
["main_end(XDOR)改修により使用不可","0122    # ==========================================================================\n0123    # 99. MMO Dormant Mode\n0124    # ==========================================================================\n0125    WAIT_SEC             240                   \n0126    #\n0127    # MMO Set HK rate to 1 second   (3sec)\n0128    # <forMPO>AJXF004A</forMPO>\n0129    WAIT_SEC             117                 \n0130    #\n0131    # MMO Switch to Dormant Mode  (70sec)\n0132    # <forMPO>AJXF002A</forMPO>\n0133    WAIT_SEC             230                   \n0134    #\n0135    # Return MOSIF heater setting   (14sec)\n0136    # <forMPO>AJXF017B</forMPO>                   \n0291    #############################################################################"]
["main_end(XOR)","0122    # ==========================================================================\n0123    # 99. MMO Dormant Mode\n0124    # ==========================================================================\n0125    WAIT_SEC             240                   \n0126    #\n0127    # MMO Set HK rate to 1 second   (3sec)\n0128    # <forMPO>AJXF004A</forMPO>\n0129    WAIT_SEC             120                 \n0130    #\n0131    # MMO Switch to Dormant Mode  (70sec)\n0132    # <forMPO>AJXF002A</forMPO>\n0133    WAIT_SEC             300                   \n0134    #\n0135    # Return MOSIF heater setting   (14sec)\n0136    # <forMPO>AJXF017B</forMPO>                   \n0291    #############################################################################"]

{"sheet":"List","index":8,"n_rows":107,"n_cols":7,"rows_kept":107,"cut":false,"hidden":false,"merged":[[89,0,91,0],[93,0,95,0],[97,0,98,0],[101,0,106,0],[45,0,48,0],[49,0,60,0],[61,0,62,0],[63,0,73,0],[74,0,86,0],[87,0,88,0],[43,0,44,0],[1,0,9,0],[10,0,27,0],[28,0,32,0],[33,0,38,0],[39,0,42,0]]}
[null,null,"Duration (sec)","source filename","filename ",null,"cmdcount"]
["BUS","BUS_CEL_MONI_OFF",40,null,"dcsm-BUS_CEL_MONI_OFF",null,1]
[null,"BUS_CEL_MONI_ON",40,null,"dcsm-BUS_CEL_MONI_ON",null,1]
[null,"BUS_CHG_BEFORE_CHK",0,null,"dcsm-BUS_CHG_BEFORE_CHK",null,0]
[null,"BUS_CHG_EMERGENCY_OFF",86,null,"dcsm-BUS_CHG_Emergency_OFF",null,5]
[null,"BUS_CHG_SET",298,null,"dcsm-BUS_CHG_SET",null,14]
[null,"BUS_CHG_START",82,null,"dcsm-BUS_CHG_START",null,2]
[null,"BUS_CHG_STOP_BAT-EXT",160,null,"dcsm-BUS_CHG_STOP_BAT-EXT",null,4]
[null,"BUS_MMO_OFF",140,null,"dcsm-BUS_MMO_OFF",null,1]
[null,"BUS_MMO_ON",80,null,"dcsm-BUS_MMO_ON",null,2]
["CRCO","CRCO_BUS_MONI_ON",310,null,"dcsm-CRCO_BUS_MONI_ON",null,10]
[null,"CRCO_CEL_MONI_OFF",40,null,"dcsm-CRCO_CEL_MONI_OFF",null,1]
[null,"CRCO_ENA",1134,null,"dcsm-CRCO_ENA_CHECK",null,18]
[null,"CRCO_HEPE",2206,null,"dcsm-CRCO_HEPE_CHECK",null,36]
[null,"CRCO_HEPI",2730,null,"dcsm-CRCO_HEPI_CHECK",null,48]
[null,"CRCO_MASTWPT",1848,null,"dcsm-CRCO_MASTWPT_CHECK",null,41]
[null,"CRCO_MDM",2332,null,"dcsm-CRCO_MDM_CHECK",null,45]
[null,"CRCO_MDP_OFF",120,null,"dcsm-CRCO_MDP_OFF",null,4]
[null,"CRCO_MDP_ON",509,null,"dcsm-CRCO_MDP_ON",null,12]
[null,"CRCO_MEA",4620,null,"dcsm-CRCO_MEA_CHECK",null,52]
[null,"CRCO_MGF",3969,null,"dcsm-CRCO_MGF_CHECK",null,49]
[null,"CRCO_MIA_C",1892,null,"dcsm-CRCO_MIA_CHECK_C",null,20]
[null,"CRCO_MSASI",6688,null,"dcsm-CRCO_MSASI_CHECK",null,23]
[null,"CRCO_MSA_C",1102,null,"dcsm-CRCO_MSA_CHECK_C",null,19]
[null,"CRCO_PME_OFF",120,null,"dcsm-CRCO_PME_OFF",null,5]
[null,"CRCO_PME_ON",160,null,"dcsm-CRCO_PME_ON",null,5]
[null,"CRCO_PWI",2448,null,"dcsm-CRCO_PWI_CHECK",null,51]
[null,"CRCO_SI_READY",377,null,"dcsm-CRCO_SI_READY",null,17]
["BUS","BUS_OFF_D",220,null,"dcsm-EF_BUS_MONI_OFF",null,5]
[null,"BUS_SETUP_D",577,null,"dcsm-EF_BUS_MONI_ON",null,20]
[null,"TLM_MODE_10",42,null,"dcsm-EF_BUS_TLM_MODE_10",null,2]
[null,"TLM_MODE_5",42,null,"dcsm-EF_BUS_TLM_MODE_5",null,2]
[null,"TLM_MODE_7",2,null,"dcsm-EF_BUS_TLM_MODE_7",null,1]
["ENA","ENA_HV_OFF",198,null,"dcsm-EF_ENA_HV_OFF",null,4]
[null,"ENA_HV_ON",344,null,"dcsm-EF_ENA_HV_ON",null,18]
[null,"ENA_HV_ON_CNT",344,null,"dcsm-EF_ENA_HV_ON_CNT",null,18]
[null,"ENA_HV_ON_H",344,null,"dcsm-EF_ENA_HV_ON_H",null,18]
[null,"ENA_OFF",88,null,"dcsm-EF_ENA_power_OFF",null,4]
[null,"ENA_ON_SETUP",564,null,"dcsm-EF_ENA_power_ON",null,7]
["HEP","HEP_HV_OFF",190,null,"dcsm-EF_HEPE_HV_OFF_OBS_OFF",null,5]
[null,"HEP_HV_ON",270,null,"dcsm-EF_HEPE_HV_ON_OBS_START",null,6]
[null,"HEP_OFF",70,null,"dcsm-EF_HEPE_OFF_STOP",null,4]
[null,"HEP_ON_SETUP",1230,null,"dcsm-EF_HEP_ON_START_for_TL",null,34]
["MDM","MDM_OFF",160,null,"dcsm-EF_MDM_OFF",null,4]
[null,"MDM_ON_SETUP",202,null,"dcsm-EF_MDM_ON",null,6]
["MDP","MDP_CRUISE_SET",42,null,"dcsm-EF_MDP_CRUISE_SET",null,2]
[null,"MDP_ERR_DUMP",9080,null,"dcsm-EF_MDP_ERR_DUMP",null,6]
[null,"MDP_ON_D",509,null,"dcsm-EF_MDP_ON",null,11]
[null,"MDP_OFF_D",120,null,"dcsm-EF_MDP_POWEROFF",null,3]
["MEA","MEA1_HV_OFF",182,null,"dcsm-EF_MEA1_HV_OFF",null,10]
[null,"MEA1_HV_ON",1702,null,"dcsm-EF_MEA1_HV_ON",null,27]
[null,"MEA1_HV_SCAN_OFF",186,null,"dcsm-EF_MEA1_HV_SCAN_OFF",null,12]
[null,"MEA1_OFF",160,null,"dcsm-EF_MEA1_OFF",null,4]
[null,"MEA1_ON_SETUP_SW",292,null,"dcsm-EF_MEA1_ON_SW",null,12]
[null,"MEA_HV_OFF",202,null,"dcsm-EF_MEA_HV_OFF",null,20]
[null,"MEA_HV_ON",1756,null,"dcsm-EF_MEA_HV_ON",null,54]
[null,"MEA_HV_ON_MOD",126,null,"dcsm-EF_MEA_HV_ON_modified",null,6]
[null,"MEA_HV_SCAN_OFF",210,null,"dcsm-EF_MEA_HV_SCAN_OFF",null,24]
[null,"MEA_OFF",164,null,"dcsm-EF_MEA_OFF",null,6]
[null,"MEA_ON_SETUP_MAG",386,null,"dcsm-EF_MEA_ON_MAG",null,21]
[null,"MEA_ON_SETUP_SW",386,null,"dcsm-EF_MEA_ON_SW",null,21]
["MGF","MGF_OFF",8,null,"dcsm-EF_MGF_OFF",null,1]
[null,"MGF_ON_SETUP",14,null,"dcsm-EF_MGF_ON",null,3]
["MIA","MIA_HV_OFF",60,null,"dcsm-EF_MIA_HV_OFF",null,1]
[null,"MIA_HV_ON",240,null,"dcsm-EF_MIA_HV_ON",null,6]
[null,"MIA_HV_ON_MAG",142,null,"dcsm-EF_MIA_HV_ON_MAG",null,4]
[null,"MIA_HV_ON_MAG_RC",262,null,"dcsm-EF_MIA_HV_ON_MAG_RC",null,7]
[null,"MIA_HV_ON_RC",280,null,"dcsm-EF_MIA_HV_ON_RC",null,7]
[null,"MIA_HV_ON_SW",102,null,"dcsm-EF_MIA_HV_ON_SW",null,3]
[null,"MIA_HV_ON_SW_RC",262,null,"dcsm-EF_MIA_HV_ON_SW_RC",null,7]
[null,"MIA_OFF",160,null,"dcsm-EF_MIA_OFF",null,4]
[null,"MIA_ON_SETUP",382,null,"dcsm-EF_MIA_ON",null,6]
[null,"MIA_ON_ASIC_LDET",582,null,"dcsm-EF_MIA_ON_ASIC_LDET",null,11]
[null,"MIA_ON_C",0,null,"dcsm-EF_MIA_ON_C",null,0]
["MSA","MSA_HV_OFF",714,null,"dcsm-EF_MSA_HV_OFF",null,24]
[null,"MSA_HV_OFF_VFB",774,null,"dcsm-EF_MSA_HV_OFF_VFB",null,25]
[null,"MSA_HV_ON_1",4692,null,"dcsm-EF_MSA_HV_ON_1",null,108]
[null,"MSA_HV_ON_1_MFB_SF",1573,null,"dcsm-EF_MSA_HV_ON_1_MFB_Safe",null,108]
[null,"MSA_HV_ON_VFB1",2882,null,"dcsm-EF_MSA_HV_ON_1_VFB",null,108]
[null,"MSA_HV_ON_2",6262,null,"dcsm-EF_MSA_HV_ON_2",null,124]
[null,"MSA_HV_ON_2_MFB_SF",1860,null,"dcsm-EF_MSA_HV_ON_2_MFB_Safe",null,124]
[null,"MSA_HV_ON_VFB2",3262,null,"dcsm-EF_MSA_HV_ON_2_VFB",null,124]
[null,"MSA_OFF",380,null,"dcsm-EF_MSA_OFF",null,25]
[null,"MSA_ON_SETUP",1092,null,"dcsm-EF_MSA_ON",null,15]
[null,"MSA_ON_SETUP_C",1092,null,"dcsm-EF_MSA_ON_C",null,15]
[null,"MSA_SOFT_RESET",120,null,"dcsm-EF_MSA_SOFT_RESET",null,3]
[null,"MSA_SOFT_RESET2",100,null,"dcsm-EF_MSA_SOFT_RESET2",null,5]
["PME","PME_OFF",40,null,"dcsm-EF_PME_OFF",null,1]
[null,"PME_ON",80,null,"dcsm-EF_PME_ON",null,2]
["PWI","PWI_OFF",80,null,"dcsm-EF_PWI_OFF",null,2]
[null,"PWI_ON",828,null,"dcsm-EF_PWI_ON",null,26]
[null,"PWI_ON_SETUP",868,null,"dcsm-EF_PWI_ON_CRUISE",null,27]
["MACRO","MC_ENA",246,null,"dcsm-MC_ENA_MDP",null,21]
["MDP","MDP_AP9_DUMP",1880,null,"dcsm-MDP_AP09_LOG_DUMP",null,4]
[null,"MDP_ERR_LOG_DUMP",9080,null,"dcsm-MDP_ERR_LOG_DUMP",null,6]
[null,"MDP_HK_REPEINT_6",42,null,"dcsm-MDP_HK_REPINT_6",null,2]
["MEA","MEA2_MEM_DMP",2550,null,"dcsm-MEA2_MEM_DMP",null,36]
["MSASI","MSASI_DARK_1",768,null,"dcsm-MSASI_dark_CO_sequence1",null,11]
[null,"MSASI_DARK_2",19498,null,"dcsm-MSASI_dark_CO_sequence2",null,55]
["MSA","MSA_TABLE_UPLOAD",0,null,"dcsm-MSA_TABLE_UPLOAD",null,0]
["TCFS","TCSF_MSASI",345,null,"dcsm-tcfs_tbl1_msasi_set",null,13]
["WAIT","WAIT3600",3600]
[null,"WAIT3500",3500]
[null,"WAIT19357",19357]
[null,"WAIT1800",1800,null,"WAIT_SEC 1800"]
[null,"WAIT10800",10800,null,"WAIT_SEC 10800"]
[null,"WAIT600",600,null,"WAIT_SEC 600"]

{"sheet":"WOL","index":9,"n_rows":19,"n_cols":5,"rows_kept":19,"cut":false,"hidden":false,"merged":[]}
[null,null,"START　TIME","2022-04-11"]
[null,null,"END　TIME","2022-05-06T05:20:00"]
[null,"ID",null,"date time excel","duration(s)"]
[null,"WOLS","WOL#1","2022-04-12T01:07:11",1200]
[null,"WOLS","WOL#2","2022-04-13T04:30:55",1200]
[null,"WOLS","WOL#3","2022-04-14T06:07:23",1200]
[null,"WOLS","WOL#4","2022-04-15T00:58:02",1200]
[null,"WOLS","WOL#5","2022-04-15T20:05:46",1200]
[null,"WOLS","WOL#6","2022-04-16T17:48:31",1200]
[null,"WOLS","WOL#7","2022-04-17T17:14:35",1200]
[null,"WOLS","WOL#8","2022-04-18T17:37:53",1200]
[null,"WOLS","WOL#9","2022-04-19T18:11:27",1200]
[null,"WOLS","WOL#10","2022-04-20T20:50:43",1200]
[null,"WOLS","WOL#11","2022-04-21T21:53:19",1200]
[null,"WOLS","WOL#12","2022-04-22T19:43:44",1200]
[null,"WOLS","WOL#13","2022-04-23T18:07:11",1200]
[null,"WOLS","WOL#14","2022-04-24T17:25:43",1200]
[null,"WOLS","WOL#15","2022-04-25T18:20:37",1200]
[null,"WOLS","WOL#16","2022-04-26T20:37:23",1200]

{"sheet":"obs_sequence","index":10,"n_rows":340,"n_cols":19,"rows_kept":340,"cut":false,"hidden":false,"merged":[[174,5,176,5],[150,5,152,5],[154,5,156,5],[160,5,162,5],[164,5,166,5],[170,5,172,5],[124,5,126,5],[130,5,132,5],[134,5,136,5],[140,5,142,5],[144,5,146,5],[100,5,102,5],[104,5,106,5],[110,5,112,5],[114,5,116,5],[120,5,122,5],[74,5,76,5],[80,5,82,5],[84,5,86,5],[90,5,92,5],[94,5,96,5],[50,5,52,5],[54,5,56,5],[60,5,62,5],[64,5,66,5],[70,5,72,5],[3,0,3,1],[3,2,3,3],[9,5,13,5],[14,5,16,5],[20,5,22,5],[24,5,26,5],[30,5,32,5],[34,5,36,5],[40,5,42,5],[44,5,46,5],[180,5,182,5],[183,5,187,5],[190,5,191,5],[193,5,199,5],[200,5,205,5],[209,5,213,5],[215,5,220,5],[224,5,228,5],[230,5,235,5],[239,5,243,5],[245,5,250,5],[254,5,258,5],[259,5,265,5],[267,5,268,5],[270,5,274,5],[275,5,277,5],[281,5,283,5],[285,5,287,5],[291,5,293,5],[295,5,297,5],[325,5,327,5],[331,5,333,5],[335,5,337,5],[301,5,303,5],[305,5,307,5],[311,5,313,5],[315,5,317,5],[321,5,323,5]]}
["START",null,{"$f":"WOL!D1","v":"2022-04-11"},"OBCP START",{"$f":"C1-12*60*60/3600/24","v":"2022-04-10T12:00:00"},null,null,null,null,null,null,"5days"]
["END",null,{"$f":"WOL!D2","v":"2022-05-06T05:20:00"},"OBCP END",{"$f":"C2+(240+120+300)/3600/24","v":"2022-05-06T05:31:00"},"CMD END",{"$f":"C2-100/3600/24","v":"2022-05-06T05:18:20"}]
[]
["Relative time (h)",null,"Absolute time (UTC)",null,null,null,null,null,null,null,null,{"$f":"+SUM(L6:L85)","v":617}]
["Start","End","Start","End","Event","Activity","Procedure","Duration (sec)",null,null,null,"cmd count","XOR Time","cmd count"]
[null,null,"2022-04-11",{"$f":"C6+H6/3600/24","v":"2022-04-11T00:09:37"},null,"BUS_ON","BUS_SETUP_D",{"$f":"VLOOKUP(G6,List!B:C,2,0)","v":577},null,null,{"$f":"VLOOKUP(G6,List!B:E,4,0)","v":"dcsm-EF_BUS_MONI_ON"},{"$f":"VLOOKUP(G6,List!B:G,6,0)","v":20},{"$f":"C6-317/3600/24","v":"2022-04-10T23:54:43"},{"$f":"+\"0000    CALL \"&K6&\" -Run\"","v":"0000    CALL dcsm-EF_BUS_MONI_ON -Run"},null,null,{"$f":"+D6-C6","v":6.6782407375285402E-3},{"$f":"+C7-C6","v":6.6782407375285402E-3},{"$f":"+D7-D6","v":5.8912037056870759E-3}]
[null,null,{"$f":"D6","v":"2022-04-11T00:09:37"},{"$f":"C7+H7/3600/24","v":"2022-04-11T00:18:06"},null,"MDP ON","MDP_ON_D",{"$f":"VLOOKUP(G7,List!B:C,2,0)","v":509},null,null,{"$f":"VLOOKUP(G7,List!B:E,4,0)","v":"dcsm-EF_MDP_ON"},{"$f":"VLOOKUP(G7,List!B:G,6,0)","v":11},"2022-04-11T00:04:20","0000    CALL dcsm-EF_MDP_ON -Run",null,null,{"$f":"+D7-C7","v":5.8912037056870759E-3},{"$f":"+C8-C7","v":5.8912037056870759E-3},4.8611110833007842E-4]
[null,null,{"$f":"D7","v":"2022-04-11T00:18:06"},{"$f":"C8+H8/3600/24","v":"2022-04-11T00:18:48"},null,null,"MDP_CRUISE_SET",{"$f":"VLOOKUP(G8,List!B:C,2,0)","v":42},null,null,{"$f":"VLOOKUP(G8,List!B:E,4,0)","v":"dcsm-EF_MDP_CRUISE_SET"},{"$f":"VLOOKUP(G8,List!B:G,6,0)","v":2},"2022-04-11T00:12:49","0000    CALL dcsm-EF_MDP_CRUISE_SET -Run",null,null,4.8611110833007842E-4,4.8611110833007842E-4,4.8611110833007842E-4]
[null,null,"2022-04-11T00:18:48","2022-04-11T00:19:30",null,"TLM mode change (MODE_10)","TLM_MODE_10",{"$f":"VLOOKUP(G9,List!B:C,2,0)","v":42},null,null,{"$f":"VLOOKUP(G9,List!B:E,4,0)","v":"dcsm-EF_BUS_TLM_MODE_10"},{"$f":"VLOOKUP(G9,List!B:G,6,0)","v":2},"2022-04-11T00:13:31","0000    CALL dcsm-EF_BUS_TLM_MODE_10 -Run",null,null,4.8611110833007842E-4,4.8611110833007842E-4,3.379629626579117E-3]
[null,null,"2022-04-11T00:19:30","2022-04-11T00:24:22",null,"SI ON","MEA1_ON_SETUP_SW",{"$f":"VLOOKUP(G10,List!B:C,2,0)","v":292},null,null,{"$f":"VLOOKUP(G10,List!B:E,4,0)","v":"dcsm-EF_MEA1_ON_SW"},{"$f":"VLOOKUP(G10,List!B:G,6,0)","v":12},"2022-04-11T00:14:13","0000    CALL dcsm-EF_MEA1_ON_SW -Run",null,null,3.379629626579117E-3,3.379629626579117E-3,1.4236111113859806E-2]
[null,null,"2022-04-11T00:24:22","2022-04-11T00:44:52",null,null,"HEP_ON_SETUP",{"$f":"VLOOKUP(G11,List!B:C,2,0)","v":1230},null,null,{"$f":"VLOOKUP(G11,List!B:E,4,0)","v":"dcsm-EF_HEP_ON_START_for_TL"},{"$f":"VLOOKUP(G11,List!B:G,6,0)","v":34},"2022-04-11T00:19:05","0000    CALL dcsm-EF_HEP_ON_START_for_TL -Run",null,null,1.4236111113859806E-2,1.4236111113859806E-2,9.2592592409346253E-4]
[null,null,"2022-04-11T00:44:52","2022-04-11T00:46:12",null,null,"PME_ON",{"$f":"VLOOKUP(G12,List!B:C,2,0)","v":80},null,null,{"$f":"VLOOKUP(G12,List!B:E,4,0)","v":"dcsm-EF_PME_ON"},{"$f":"VLOOKUP(G12,List!B:G,6,0)","v":2},"2022-04-11T00:39:35","0000    CALL dcsm-EF_PME_ON -Run",null,null,9.2592592409346253E-4,9.2592592409346253E-4,1.6203703853534535E-4]
[null,null,"2022-04-11T00:46:12","2022-04-11T00:46:26",null,null,"MGF_ON_SETUP",{"$f":"VLOOKUP(G13,List!B:C,2,0)","v":14},null,null,{"$f":"VLOOKUP(G13,List!B:E,4,0)","v":"dcsm-EF_MGF_ON"},{"$f":"VLOOKUP(G13,List!B:G,6,0)","v":3},"2022-04-11T00:40:55","0000    CALL dcsm-EF_MGF_ON -Run",null,null,1.6203703853534535E-4,1.6203703853534535E-4,6.5277777757728472E-3]
[null,null,"2022-04-11T00:46:26","2022-04-11T00:55:50",null,null,"ENA_ON_SETUP",{"$f":"VLOOKUP(G14,List!B:C,2,0)","v":564},null,null,{"$f":"VLOOKUP(G14,List!B:E,4,0)","v":"dcsm-EF_ENA_power_ON"},{"$f":"VLOOKUP(G14,List!B:G,6,0)","v":7},"2022-04-11T00:41:09","0000    CALL dcsm-EF_ENA_power_ON -Run",null,null,6.5277777757728472E-3,6.5277777757728472E-3,3.125000002910383E-3]
[null,null,{"$f":"D14","v":"2022-04-11T00:55:50"},"2022-04-11T01:00:20",null,"SI HV ON","HEP_HV_ON",{"$f":"VLOOKUP(G15,List!B:C,2,0)","v":270},null,null,{"$f":"VLOOKUP(G15,List!B:E,4,0)","v":"dcsm-EF_HEPE_HV_ON_OBS_START"},{"$f":"VLOOKUP(G15,List!B:G,6,0)","v":6},"2022-04-11T00:50:33",{"$f":"+\"0000    CALL \"&K15&\" -Run\"","v":"0000    CALL dcsm-EF_HEPE_HV_ON_OBS_START -Run"},null,null,3.125000002910383E-3,3.125000002910383E-3,3.9814814808778465E-3]
[null,null,{"$f":"D15","v":"2022-04-11T01:00:20"},"2022-04-11T01:06:04",null,null,"ENA_HV_ON_CNT",{"$f":"VLOOKUP(G16,List!B:C,2,0)","v":344},null,null,{"$f":"VLOOKUP(G16,List!B:E,4,0)","v":"dcsm-EF_ENA_HV_ON_CNT"},{"$f":"VLOOKUP(G16,List!B:G,6,0)","v":18},"2022-04-11T00:55:03",{"$f":"+\"0000    CALL \"&K16&\" -Run\"","v":"0000    CALL dcsm-EF_ENA_HV_ON_CNT -Run"},null,null,3.9814814808778465E-3,3.9814814808778465E-3,1.9699074073287193E-2]
[null,null,"2022-04-11T01:06:04","2022-04-11T01:34:26",null,null,"MEA1_HV_ON",{"$f":"VLOOKUP(G17,List!B:C,2,0)","v":1702},null,null,{"$f":"VLOOKUP(G17,List!B:E,4,0)","v":"dcsm-EF_MEA1_HV_ON"},{"$f":"VLOOKUP(G17,List!B:G,6,0)","v":27},"2022-04-11T01:00:47","0000    CALL dcsm-EF_MEA1_HV_ON -Run",null,null,1.9699074073287193E-2,1.9699074073287193E-2,4.8611110833007842E-4]
[null,null,"2022-04-11T01:34:26","2022-04-11T01:35:08",null,"TLM mode change (MODE_5)","TLM_MODE_5",{"$f":"VLOOKUP(G18,List!B:C,2,0)","v":42},null,null,{"$f":"VLOOKUP(G18,List!B:E,4,0)","v":"dcsm-EF_BUS_TLM_MODE_5"},{"$f":"VLOOKUP(G18,List!B:G,6,0)","v":2},"2022-04-11T01:29:09","0000    CALL dcsm-EF_BUS_TLM_MODE_5 -Run",null,null,4.8611110833007842E-4,4.8611110833007842E-4,0.97350694446504349]
[null,null,"2022-04-11T01:35:08",{"$f":"C20","v":"2022-04-12T00:56:59"},"Observation A",null,null,{"$f":"(D19-C19)*3600*24","v":84111.000001779757},{"$f":"H19/3600","v":23.364166667161044},null,null,0,"2022-04-11T01:29:51",{"$f":"\"0000    WAIT_SEC  \"&TEXT(H19,\"#0\")","v":"0000    WAIT_SEC  84111"},null,null,0.97350694446504349,0.97350694446504349,4.8611110833007842E-4]
[null,null,{"$f":"D20-H20/3600/24","v":"2022-04-12T00:56:59"},{"$f":"C21","v":"2022-04-12T00:57:41"},null,"TLM mode change (MODE_10)","TLM_MODE_10",{"$f":"VLOOKUP(G20,List!B:C,2,0)","v":42},null,null,{"$f":"VLOOKUP(G20,List!B:E,4,0)","v":"dcsm-EF_BUS_TLM_MODE_10"},{"$f":"VLOOKUP(G20,List!B:G,6,0)","v":2},"2022-04-12T00:51:42",{"$f":"+\"0000    CALL \"&K20&\" -Run\"","v":"0000    CALL dcsm-EF_BUS_TLM_MODE_10 -Run"},null,null,4.8611110833007842E-4,4.8611110833007842E-4,2.1990740715409629E-3]
[null,null,{"$f":"D21-H21/3600/24","v":"2022-04-12T00:57:41"},{"$f":"C22","v":"2022-04-12T01:00:51"},null,"SI HV OFF","HEP_HV_OFF",{"$f":"VLOOKUP(G21,List!B:C,2,0)","v":190},null,null,{"$f":"VLOOKUP(G21,List!B:E,4,0)","v":"dcsm-EF_HEPE_HV_OFF_OBS_OFF"},{"$f":"VLOOKUP(G21,List!B:G,6,0)","v":5},"2022-04-12T00:52:24","0000    CALL dcsm-EF_HEPE_HV_OFF_OBS_OFF -Run",null,null,2.1990740715409629E-3,2.1990740715409629E-3,2.2916666639503092E-3]
[null,null,{"$f":"D22-H22/3600/24","v":"2022-04-12T01:00:51"},{"$f":"C23","v":"2022-04-12T01:04:09"},null,null,"ENA_HV_OFF",{"$f":"VLOOKUP(G22,List!B:C,2,0)","v":198},null,null,{"$f":"VLOOKUP(G22,List!B:E,4,0)","v":"dcsm-EF_ENA_HV_OFF"},{"$f":"VLOOKUP(G22,List!B:G,6,0)","v":4},"2022-04-12T00:55:34","0000    CALL dcsm-EF_ENA_HV_OFF -Run",null,null,2.2916666639503092E-3,2.2916666639503092E-3,2.1064814791316167E-3]
[null,null,{"$f":"D23-H23/3600/24","v":"2022-04-12T01:04:09"},{"$f":"C24","v":"2022-04-12T01:07:11"},null,null,"MEA1_HV_OFF",{"$f":"VLOOKUP(G23,List!B:C,2,0)","v":182},null,null,{"$f":"VLOOKUP(G23,List!B:E,4,0)","v":"dcsm-EF_MEA1_HV_OFF"},{"$f":"VLOOKUP(G23,List!B:G,6,0)","v":10},"2022-04-12T00:58:52","0000    CALL dcsm-EF_MEA1_HV_OFF -Run",null,null,2.1064814791316167E-3,2.1064814791316167E-3,1.3888888890505768E-2]
[null,null,"2022-04-12T01:07:11",{"$f":"C24+H24/3600/24","v":"2022-04-12T01:27:11"},"WOL#1",null,{"$f":"(C25-D23)*24*3600","v":1800.0000002095476},1200,null,null,null,0,"2022-04-12T01:01:54",{"$f":"\"0000    WAIT_SEC  \"&TEXT(G24,\"#0\")","v":"0000    WAIT_SEC  1800"},null,null,1.3888888890505768E-2,2.0833333335758653E-2,1.0069444448163267E-2]
[null,null,{"$f":"D24+10/60/24","v":"2022-04-12T01:37:11"},{"$f":"C25+H25/3600/24","v":"2022-04-12T01:41:41"},null,"SI HV ON","HEP_HV_ON",{"$f":"VLOOKUP(G25,List!B:C,2,0)","v":270},null,null,{"$f":"VLOOKUP(G25,List!B:E,4,0)","v":"dcsm-EF_HEPE_HV_ON_OBS_START"},{"$f":"VLOOKUP(G25,List!B:G,6,0)","v":6},"2022-04-12T01:31:54",{"$f":"+\"0000    CALL \"&K25&\" -Run\"","v":"0000    CALL dcsm-EF_HEPE_HV_ON_OBS_START -Run"},null,null,3.125000002910383E-3,3.125000002910383E-3,3.9814814808778465E-3]
[null,null,{"$f":"D25","v":"2022-04-12T01:41:41"},"2022-04-12T01:47:25",null,null,"ENA_HV_ON_CNT",{"$f":"VLOOKUP(G26,List!B:C,2,0)","v":344},null,null,{"$f":"VLOOKUP(G26,List!B:E,4,0)","v":"dcsm-EF_ENA_HV_ON_CNT"},{"$f":"VLOOKUP(G26,List!B:G,6,0)","v":18},"2022-04-12T01:36:24",{"$f":"+\"0000    CALL \"&K26&\" -Run\"","v":"0000    CALL dcsm-EF_ENA_HV_ON_CNT -Run"},null,null,3.9814814808778465E-3,3.9814814808778465E-3,1.9699074073287193E-2]
[null,null,"2022-04-12T01:47:25","2022-04-12T02:15:47",null,null,"MEA1_HV_ON",{"$f":"VLOOKUP(G27,List!B:C,2,0)","v":1702},null,null,{"$f":"VLOOKUP(G27,List!B:E,4,0)","v":"dcsm-EF_MEA1_HV_ON"},{"$f":"VLOOKUP(G27,List!B:G,6,0)","v":27},"2022-04-12T01:42:08","0000    CALL dcsm-EF_MEA1_HV_ON -Run",null,null,1.9699074073287193E-2,1.9699074073287193E-2,4.8611110833007842E-4]
[null,null,"2022-04-12T02:15:47","2022-04-12T02:16:29",null,"TLM mode change (MODE_5)","TLM_MODE_5",{"$f":"VLOOKUP(G28,List!B:C,2,0)","v":42},null,null,{"$f":"VLOOKUP(G28,List!B:E,4,0)","v":"dcsm-EF_BUS_TLM_MODE_5"},{"$f":"VLOOKUP(G28,List!B:G,6,0)","v":2},"2022-04-12T02:10:30","0000    CALL dcsm-EF_BUS_TLM_MODE_5 -Run",null,null,4.8611110833007842E-4,4.8611110833007842E-4,1.0862731481611263]
[null,null,"2022-04-12T02:16:29",{"$f":"C30","v":"2022-04-13T04:20:43"},"Observation B",null,null,{"$f":"(D29-C29)*3600*24","v":93854.000001121312},{"$f":"H29/3600","v":26.070555555867031},null,null,0,"2022-04-12T02:11:12",{"$f":"\"0000    WAIT_SEC  \"&TEXT(H29,\"#0\")","v":"0000    WAIT_SEC  93854"},null,null,1.0862731481611263,1.0862731481611263,4.8611110833007842E-4]
[null,null,{"$f":"D30-H30/3600/24","v":"2022-04-13T04:20:43"},{"$f":"C31","v":"2022-04-13T04:21:25"},null,"TLM mode change (MODE_10)","TLM_MODE_10",{"$f":"VLOOKUP(G30,List!B:C,2,0)","v":42},null,null,{"$f":"VLOOKUP(G30,List!B:E,4,0)","v":"dcsm-EF_BUS_TLM_MODE_10"},{"$f":"VLOOKUP(G30,List!B:G,6,0)","v":2},"2022-04-13T04:15:26",{"$f":"+\"0000    CALL \"&K30&\" -Run\"","v":"0000    CALL dcsm-EF_BUS_TLM_MODE_10 -Run"},null,null,4.8611110833007842E-4,4.8611110833007842E-4,2.1990740715409629E-3]
[null,null,{"$f":"D31-H31/3600/24","v":"2022-04-13T04:21:25"},{"$f":"C32","v":"2022-04-13T04:24:35"},null,"SI HV OFF","HEP_HV_OFF",{"$f":"VLOOKUP(G31,List!B:C,2,0)","v":190},null,null,{"$f":"VLOOKUP(G31,List!B:E,4,0)","v":"dcsm-EF_HEPE_HV_OFF_OBS_OFF"},{"$f":"VLOOKUP(G31,List!B:G,6,0)","v":5},"2022-04-13T04:16:08","0000    CALL dcsm-EF_HEPE_HV_OFF_OBS_OFF -Run",null,null,2.1990740715409629E-3,2.1990740715409629E-3,2.2916666639503092E-3]
[null,null,{"$f":"D32-H32/3600/24","v":"2022-04-13T04:24:35"},{"$f":"C33","v":"2022-04-13T04:27:53"},null,null,"ENA_HV_OFF",{"$f":"VLOOKUP(G32,List!B:C,2,0)","v":198},null,null,{"$f":"VLOOKUP(G32,List!B:E,4,0)","v":"dcsm-EF_ENA_HV_OFF"},{"$f":"VLOOKUP(G32,List!B:G,6,0)","v":4},"2022-04-13T04:19:18","0000    CALL dcsm-EF_ENA_HV_OFF -Run",null,null,2.2916666639503092E-3,2.2916666639503092E-3,2.1064814791316167E-3]
[null,null,{"$f":"D33-H33/3600/24","v":"2022-04-13T04:27:53"},{"$f":"C34","v":"2022-04-13T04:30:55"},null,null,"MEA1_HV_OFF",{"$f":"VLOOKUP(G33,List!B:C,2,0)","v":182},null,null,{"$f":"VLOOKUP(G33,List!B:E,4,0)","v":"dcsm-EF_MEA1_HV_OFF"},{"$f":"VLOOKUP(G33,List!B:G,6,0)","v":10},"2022-04-13T04:22:36","0000    CALL dcsm-EF_MEA1_HV_OFF -Run",null,null,2.1064814791316167E-3,2.1064814791316167E-3,1.3888888890505768E-2]
[null,null,"2022-04-13T04:30:55",{"$f":"C34+H34/3600/24","v":"2022-04-13T04:50:55"},"WOL#2",null,{"$f":"(C35-D33)*24*3600","v":1800.0000002095476},1200,null,null,null,0,"2022-04-13T04:25:38",{"$f":"\"0000    WAIT_SEC  \"&TEXT(G34,\"#0\")","v":"0000    WAIT_SEC  1800"},null,null,1.3888888890505768E-2,2.0833333335758653E-2,1.0069444448163267E-2]
[null,null,{"$f":"D34+10/60/24","v":"2022-04-13T05:00:55"},{"$f":"C35+H35/3600/24","v":"2022-04-13T05:05:25"},null,"SI HV ON","HEP_HV_ON",{"$f":"VLOOKUP(G35,List!B:C,2,0)","v":270},null,null,{"$f":"VLOOKUP(G35,List!B:E,4,0)","v":"dcsm-EF_HEPE_HV_ON_OBS_START"},{"$f":"VLOOKUP(G35,List!B:G,6,0)","v":6},"2022-04-13T04:55:38",{"$f":"+\"0000    CALL \"&K35&\" -Run\"","v":"0000    CALL dcsm-EF_HEPE_HV_ON_OBS_START -Run"},null,null,3.125000002910383E-3,3.125000002910383E-3,3.9814814808778465E-3]
[null,null,{"$f":"D35","v":"2022-04-13T05:05:25"},"2022-04-13T05:11:09",null,null,"ENA_HV_ON_CNT",{"$f":"VLOOKUP(G36,List!B:C,2,0)","v":344},null,null,{"$f":"VLOOKUP(G36,List!B:E,4,0)","v":"dcsm-EF_ENA_HV_ON_CNT"},{"$f":"VLOOKUP(G36,List!B:G,6,0)","v":18},"2022-04-13T05:00:08",{"$f":"+\"0000    CALL \"&K36&\" -Run\"","v":"0000    CALL dcsm-EF_ENA_HV_ON_CNT -Run"},null,null,3.9814814808778465E-3,3.9814814808778465E-3,1.9699074073287193E-2]
[null,null,"2022-04-13T05:11:09","2022-04-13T05:39:31",null,null,"MEA1_HV_ON",{"$f":"VLOOKUP(G37,List!B:C,2,0)","v":1702},null,null,{"$f":"VLOOKUP(G37,List!B:E,4,0)","v":"dcsm-EF_MEA1_HV_ON"},{"$f":"VLOOKUP(G37,List!B:G,6,0)","v":27},"2022-04-13T05:05:52","0000    CALL dcsm-EF_MEA1_HV_ON -Run",null,null,1.9699074073287193E-2,1.9699074073287193E-2,4.8611110833007842E-4]
[null,null,"2022-04-13T05:39:31","2022-04-13T05:40:13",null,"TLM mode change (MODE_5)","TLM_MODE_5",{"$f":"VLOOKUP(G38,List!B:C,2,0)","v":42},null,null,{"$f":"VLOOKUP(G38,List!B:E,4,0)","v":"dcsm-EF_BUS_TLM_MODE_5"},{"$f":"VLOOKUP(G38,List!B:G,6,0)","v":2},"2022-04-13T05:34:14","0000    CALL dcsm-EF_BUS_TLM_MODE_5 -Run",null,null,4.8611110833007842E-4,4.8611110833007842E-4,1.0117824074113742]
[null,null,"2022-04-13T05:40:13",{"$f":"C40","v":"2022-04-14T05:57:11"},"Observation C",null,null,{"$f":"(D39-C39)*3600*24","v":87418.000000342727},{"$f":"H39/3600","v":24.28277777787298},null,null,0,"2022-04-13T05:34:56",{"$f":"\"0000    WAIT_SEC  \"&TEXT(H39,\"#0\")","v":"0000    WAIT_SEC  87418"},null,null,1.0117824074113742,1.0117824074113742,4.8611110833007842E-4]
[null,null,{"$f":"D40-H40/3600/24","v":"2022-04-14T05:57:11"},{"$f":"C41","v":"2022-04-14T05:57:53"},null,"TLM mode change (MODE_10)","TLM_MODE_10",{"$f":"VLOOKUP(G40,List!B:C,2,0)","v":42},null,null,{"$f":"VLOOKUP(G40,List!B:E,4,0)","v":"dcsm-EF_BUS_TLM_MODE_10"},{"$f":"VLOOKUP(G40,List!B:G,6,0)","v":2},"2022-04-14T05:51:54",{"$f":"+\"0000    CALL \"&K40&\" -Run\"","v":"0000    CALL dcsm-EF_BUS_TLM_MODE_10 -Run"},null,null,4.8611110833007842E-4,4.8611110833007842E-4,2.1990740715409629E-3]
[null,null,{"$f":"D41-H41/3600/24","v":"2022-04-14T05:57:53"},{"$f":"C42","v":"2022-04-14T06:01:03"},null,"SI HV OFF","HEP_HV_OFF",{"$f":"VLOOKUP(G41,List!B:C,2,0)","v":190},null,null,{"$f":"VLOOKUP(G41,List!B:E,4,0)","v":"dcsm-EF_HEPE_HV_OFF_OBS_OFF"},{"$f":"VLOOKUP(G41,List!B:G,6,0)","v":5},"2022-04-14T05:52:36","0000    CALL dcsm-EF_HEPE_HV_OFF_OBS_OFF -Run",null,null,2.1990740715409629E-3,2.1990740715409629E-3,2.2916666639503092E-3]
[null,null,{"$f":"D42-H42/3600/24","v":"2022-04-14T06:01:03"},{"$f":"C43","v":"2022-04-14T06:04:21"},null,null,"ENA_HV_OFF",{"$f":"VLOOKUP(G42,List!B:C,2,0)","v":198},null,null,{"$f":"VLOOKUP(G42,List!B:E,4,0)","v":"dcsm-EF_ENA_HV_OFF"},{"$f":"VLOOKUP(G42,List!B:G,6,0)","v":4},"2022-04-14T05:55:46","0000    CALL dcsm-EF_ENA_HV_OFF -Run",null,null,2.2916666639503092E-3,2.2916666639503092E-3,2.1064814791316167E-3]
[null,null,{"$f":"D43-H43/3600/24","v":"2022-04-14T06:04:21"},{"$f":"C44","v":"2022-04-14T06:07:23"},null,null,"MEA1_HV_OFF",{"$f":"VLOOKUP(G43,List!B:C,2,0)","v":182},null,null,{"$f":"VLOOKUP(G43,List!B:E,4,0)","v":"dcsm-EF_MEA1_HV_OFF"},{"$f":"VLOOKUP(G43,List!B:G,6,0)","v":10},"2022-04-14T05:59:04","0000    CALL dcsm-EF_MEA1_HV_OFF -Run",null,null,2.1064814791316167E-3,2.1064814791316167E-3,1.3888888890505768E-2]
[null,null,"2022-04-14T06:07:23",{"$f":"C44+H44/3600/24","v":"2022-04-14T06:27:23"},"WOL#3",null,{"$f":"(C45-D43)*24*3600","v":1800.0000002095476},1200,null,null,null,0,"2022-04-14T06:02:06",{"$f":"\"0000    WAIT_SEC  \"&TEXT(G44,\"#0\")","v":"0000    WAIT_SEC  1800"},null,null,1.3888888890505768E-2,2.0833333335758653E-2,1.0069444448163267E-2]
[null,null,{"$f":"D44+10/60/24","v":"2022-04-14T06:37:23"},{"$f":"C45+H45/3600/24","v":"2022-04-14T06:41:53"},null,"SI HV ON","HEP_HV_ON",{"$f":"VLOOKUP(G45,List!B:C,2,0)","v":270},null,null,{"$f":"VLOOKUP(G45,List!B:E,4,0)","v":"dcsm-EF_HEPE_HV_ON_OBS_START"},{"$f":"VLOOKUP(G45,List!B:G,6,0)","v":6},"2022-04-14T06:32:06",{"$f":"+\"0000    CALL \"&K45&\" -Run\"","v":"0000    CALL dcsm-EF_HEPE_HV_ON_OBS_START -Run"},null,null,3.125000002910383E-3,3.125000002910383E-3,3.9814814808778465E-3]
[null,null,{"$f":"D45","v":"2022-04-14T06:41:53"},"2022-04-14T06:47:37",null,null,"ENA_HV_ON_CNT",{"$f":"VLOOKUP(G46,List!B:C,2,0)","v":344},null,null,{"$f":"VLOOKUP(G46,List!B:E,4,0)","v":"dcsm-EF_ENA_HV_ON_CNT"},{"$f":"VLOOKUP(G46,List!B:G,6,0)","v":18},"2022-04-14T06:36:36",{"$f":"+\"0000    CALL \"&K46&\" -Run\"","v":"0000    CALL dcsm-EF_ENA_HV_ON_CNT -Run"},null,null,3.9814814808778465E-3,3.9814814808778465E-3,1.9699074073287193E-2]
[null,null,"2022-04-14T06:47:37","2022-04-14T07:15:59",null,null,"MEA1_HV_ON",{"$f":"VLOOKUP(G47,List!B:C,2,0)","v":1702},null,null,{"$f":"VLOOKUP(G47,List!B:E,4,0)","v":"dcsm-EF_MEA1_HV_ON"},{"$f":"VLOOKUP(G47,List!B:G,6,0)","v":27},"2022-04-14T06:42:20","0000    CALL dcsm-EF_MEA1_HV_ON -Run",null,null,1.9699074073287193E-2,1.9699074073287193E-2,4.8611110833007842E-4]
[null,null,"2022-04-14T07:15:59","2022-04-14T07:16:41",null,"TLM mode change (MODE_5)","TLM_MODE_5",{"$f":"VLOOKUP(G48,List!B:C,2,0)","v":42},null,null,{"$f":"VLOOKUP(G48,List!B:E,4,0)","v":"dcsm-EF_BUS_TLM_MODE_5"},{"$f":"VLOOKUP(G48,List!B:G,6,0)","v":2},"2022-04-14T07:10:42","0000    CALL dcsm-EF_BUS_TLM_MODE_5 -Run",null,null,4.8611110833007842E-4,4.8611110833007842E-4,0.72996527778741438]
[null,null,"2022-04-14T07:16:41",{"$f":"C50","v":"2022-04-15T00:47:50"},"Observation D",null,null,{"$f":"(D49-C49)*3600*24","v":63069.000000832602},{"$f":"H49/3600","v":17.519166666897945},null,null,0,"2022-04-14T07:11:24",{"$f":"\"0000    WAIT_SEC  \"&TEXT(H49,\"#0\")","v":"0000    WAIT_SEC  63069"},null,null,0.72996527778741438,0.72996527778741438,4.8611110833007842E-4]
[null,null,{"$f":"D50-H50/3600/24","v":"2022-04-15T00:47:50"},{"$f":"C51","v":"2022-04-15T00:48:32"},null,"TLM mode change (MODE_10)","TLM_MODE_10",{"$f":"VLOOKUP(G50,List!B:C,2,0)","v":42},null,null,{"$f":"VLOOKUP(G50,List!B:E,4,0)","v":"dcsm-EF_BUS_TLM_MODE_10"},{"$f":"VLOOKUP(G50,List!B:G,6,0)","v":2},"2022-04-15T00:42:33",{"$f":"+\"0000    CALL \"&K50&\" -Run\"","v":"0000    CALL dcsm-EF_BUS_TLM_MODE_10 -Run"},null,null,4.8611110833007842E-4,4.8611110833007842E-4,2.1990740715409629E-3]
[null,null,{"$f":"D51-H51/3600/24","v":"2022-04-15T00:48:32"},{"$f":"C52","v":"2022-04-15T00:51:42"},null,"SI HV OFF","HEP_HV_OFF",{"$f":"VLOOKUP(G51,List!B:C,2,0)","v":190},null,null,{"$f":"VLOOKUP(G51,List!B:E,4,0)","v":"dcsm-EF_HEPE_HV_OFF_OBS_OFF"},{"$f":"VLOOKUP(G51,List!B:G,6,0)","v":5},"2022-04-15T00:43:15","0000    CALL dcsm-EF_HEPE_HV_OFF_OBS_OFF -Run",null,null,2.1990740715409629E-3,2.1990740715409629E-3,2.2916666639503092E-3]
[null,null,{"$f":"D52-H52/3600/24","v":"2022-04-15T00:51:42"},{"$f":"C53","v":"2022-04-15T00:55:00"},null,null,"ENA_HV_OFF",{"$f":"VLOOKUP(G52,List!B:C,2,0)","v":198},null,null,{"$f":"VLOOKUP(G52,List!B:E,4,0)","v":"dcsm-EF_ENA_HV_OFF"},{"$f":"VLOOKUP(G52,List!B:G,6,0)","v":4},"2022-04-15T00:46:25","0000    CALL dcsm-EF_ENA_HV_OFF -Run",null,null,2.2916666639503092E-3,2.2916666639503092E-3,2.1064814791316167E-3]
[null,null,{"$f":"D53-H53/3600/24","v":"2022-04-15T00:55:00"},{"$f":"C54","v":"2022-04-15T00:58:02"},null,null,"MEA1_HV_OFF",{"$f":"VLOOKUP(G53,List!B:C,2,0)","v":182},null,null,{"$f":"VLOOKUP(G53,List!B:E,4,0)","v":"dcsm-EF_MEA1_HV_OFF"},{"$f":"VLOOKUP(G53,List!B:G,6,0)","v":10},"2022-04-15T00:49:43","0000    CALL dcsm-EF_MEA1_HV_OFF -Run",null,null,2.1064814791316167E-3,2.1064814791316167E-3,1.3888888890505768E-2]
[null,null,"2022-04-15T00:58:02",{"$f":"C54+H54/3600/24","v":"2022-04-15T01:18:02"},"WOL#4",null,{"$f":"(C55-D53)*24*3600","v":1800.0000002095476},1200,null,null,null,0,"2022-04-15T00:52:45",{"$f":"\"0000    WAIT_SEC  \"&TEXT(G54,\"#0\")","v":"0000    WAIT_SEC  1800"},null,null,1.3888888890505768E-2,2.0833333335758653E-2,1.0069444448163267E-2]
[null,null,{"$f":"D54+10/60/24","v":"2022-04-15T01:28:02"},{"$f":"C55+H55/3600/24","v":"2022-04-15T01:32:32"},null,"SI HV ON","HEP_HV_ON",{"$f":"VLOOKUP(G55,List!B:C,2,0)","v":270},null,null,{"$f":"VLOOKUP(G55,List!B:E,4,0)","v":"dcsm-EF_HEPE_HV_ON_OBS_START"},{"$f":"VLOOKUP(G55,List!B:G,6,0)","v":6},"2022-04-15T01:22:45",{"$f":"+\"0000    CALL \"&K55&\" -Run\"","v":"0000    CALL dcsm-EF_HEPE_HV_ON_OBS_START -Run"},null,null,3.125000002910383E-3,3.125000002910383E-3,3.9814814808778465E-3]
[null,null,{"$f":"D55","v":"2022-04-15T01:32:32"},"2022-04-15T01:38:16",null,null,"ENA_HV_ON_CNT",{"$f":"VLOOKUP(G56,List!B:C,2,0)","v":344},null,null,{"$f":"VLOOKUP(G56,List!B:E,4,0)","v":"dcsm-EF_ENA_HV_ON_CNT"},{"$f":"VLOOKUP(G56,List!B:G,6,0)","v":18},"2022-04-15T01:27:15",{"$f":"+\"0000    CALL \"&K56&\" -Run\"","v":"0000    CALL dcsm-EF_ENA_HV_ON_CNT -Run"},null,null,3.9814814808778465E-3,3.9814814808778465E-3,1.9699074073287193E-2]
[null,null,"2022-04-15T01:38:16","2022-04-15T02:06:38",null,null,"MEA1_HV_ON",{"$f":"VLOOKUP(G57,List!B:C,2,0)","v":1702},null,null,{"$f":"VLOOKUP(G57,List!B:E,4,0)","v":"dcsm-EF_MEA1_HV_ON"},{"$f":"VLOOKUP(G57,List!B:G,6,0)","v":27},"2022-04-15T01:32:59","0000    CALL dcsm-EF_MEA1_HV_ON -Run",null,null,1.9699074073287193E-2,1.9699074073287193E-2,4.8611110833007842E-4]
[null,null,"2022-04-15T02:06:38","2022-04-15T02:07:20",null,"TLM mode change (MODE_5)","TLM_MODE_5",{"$f":"VLOOKUP(G58,List!B:C,2,0)","v":42},null,null,{"$f":"VLOOKUP(G58,List!B:E,4,0)","v":"dcsm-EF_BUS_TLM_MODE_5"},{"$f":"VLOOKUP(G58,List!B:G,6,0)","v":2},"2022-04-15T02:01:21","0000    CALL dcsm-EF_BUS_TLM_MODE_5 -Run",null,null,4.8611110833007842E-4,4.8611110833007842E-4,0.74182870371441822]
[null,null,"2022-04-15T02:07:20",{"$f":"C60","v":"2022-04-15T19:55:34"},"Observation E",null,null,{"$f":"(D59-C59)*3600*24","v":64094.000000925735},{"$f":"H59/3600","v":17.803888889146037},null,null,0,"2022-04-15T02:02:03",{"$f":"\"0000    WAIT_SEC  \"&TEXT(H59,\"#0\")","v":"0000    WAIT_SEC  64094"},null,null,0.74182870371441822,0.74182870371441822,4.8611110833007842E-4]
[null,null,{"$f":"D60-H60/3600/24","v":"2022-04-15T19:55:34"},{"$f":"C61","v":"2022-04-15T19:56:16"},null,"TLM mode change (MODE_10)","TLM_MODE_10",{"$f":"VLOOKUP(G60,List!B:C,2,0)","v":42},null,null,{"$f":"VLOOKUP(G60,List!B:E,4,0)","v":"dcsm-EF_BUS_TLM_MODE_10"},{"$f":"VLOOKUP(G60,List!B:G,6,0)","v":2},"2022-04-15T19:50:17",{"$f":"+\"0000    CALL \"&K60&\" -Run\"","v":"0000    CALL dcsm-EF_BUS_TLM_MODE_10 -Run"},null,null,4.8611110833007842E-4,4.8611110833007842E-4,2.1990740715409629E-3]
[null,null,{"$f":"D61-H61/3600/24","v":"2022-04-15T19:56:16"},{"$f":"C62","v":"2022-04-15T19:59:26"},null,"SI HV OFF","HEP_HV_OFF",{"$f":"VLOOKUP(G61,List!B:C,2,0)","v":190},null,null,{"$f":"VLOOKUP(G61,List!B:E,4,0)","v":"dcsm-EF_HEPE_HV_OFF_OBS_OFF"},{"$f":"VLOOKUP(G61,List!B:G,6,0)","v":5},"2022-04-15T19:50:59","0000    CALL dcsm-EF_HEPE_HV_OFF_OBS_OFF -Run",null,null,2.1990740715409629E-3,2.1990740715409629E-3,2.2916666639503092E-3]
[null,null,{"$f":"D62-H62/3600/24","v":"2022-04-15T19:59:26"},{"$f":"C63","v":"2022-04-15T20:02:44"},null,null,"ENA_HV_OFF",{"$f":"VLOOKUP(G62,List!B:C,2,0)","v":198},null,null,{"$f":"VLOOKUP(G62,List!B:E,4,0)","v":"dcsm-EF_ENA_HV_OFF"},{"$f":"VLOOKUP(G62,List!B:G,6,0)","v":4},"2022-04-15T19:54:09","0000    CALL dcsm-EF_ENA_HV_OFF -Run",null,null,2.2916666639503092E-3,2.2916666639503092E-3,2.1064814791316167E-3]
[null,null,{"$f":"D63-H63/3600/24","v":"2022-04-15T20:02:44"},{"$f":"C64","v":"2022-04-15T20:05:46"},null,null,"MEA1_HV_OFF",{"$f":"VLOOKUP(G63,List!B:C,2,0)","v":182},null,null,{"$f":"VLOOKUP(G63,List!B:E,4,0)","v":"dcsm-EF_MEA1_HV_OFF"},{"$f":"VLOOKUP(G63,List!B:G,6,0)","v":10},"2022-04-15T19:57:27","0000    CALL dcsm-EF_MEA1_HV_OFF -Run",null,null,2.1064814791316167E-3,2.1064814791316167E-3,1.3888888890505768E-2]
[null,null,"2022-04-15T20:05:46",{"$f":"C64+H64/3600/24","v":"2022-04-15T20:25:46"},"WOL#5",null,{"$f":"(C65-D63)*24*3600","v":1800.0000002095476},1200,null,null,null,0,"2022-04-15T20:00:29",{"$f":"\"0000    WAIT_SEC  \"&TEXT(G64,\"#0\")","v":"0000    WAIT_SEC  1800"},null,null,1.3888888890505768E-2,2.0833333335758653E-2,1.0069444448163267E-2]
[null,null,{"$f":"D64+10/60/24","v":"2022-04-15T20:35:46"},{"$f":"C65+H65/3600/24","v":"2022-04-15T20:40:16"},null,"SI HV ON","HEP_HV_ON",{"$f":"VLOOKUP(G65,List!B:C,2,0)","v":270},null,null,{"$f":"VLOOKUP(G65,List!B:E,4,0)","v":"dcsm-EF_HEPE_HV_ON_OBS_START"},{"$f":"VLOOKUP(G65,List!B:G,6,0)","v":6},"2022-04-15T20:30:29",{"$f":"+\"0000    CALL \"&K65&\" -Run\"","v":"0000    CALL dcsm-EF_HEPE_HV_ON_OBS_START -Run"},null,null,3.125000002910383E-3,3.125000002910383E-3,3.9814814808778465E-3]
[null,null,{"$f":"D65","v":"2022-04-15T20:40:16"},"2022-04-15T20:46:00",null,null,"ENA_HV_ON_CNT",{"$f":"VLOOKUP(G66,List!B:C,2,0)","v":344},null,null,{"$f":"VLOOKUP(G66,List!B:E,4,0)","v":"dcsm-EF_ENA_HV_ON_CNT"},{"$f":"VLOOKUP(G66,List!B:G,6,0)","v":18},"2022-04-15T20:34:59",{"$f":"+\"0000    CALL \"&K66&\" -Run\"","v":"0000    CALL dcsm-EF_ENA_HV_ON_CNT -Run"},null,null,3.9814814808778465E-3,3.9814814808778465E-3,1.9699074073287193E-2]
[null,null,"2022-04-15T20:46:00","2022-04-15T21:14:22",null,null,"MEA1_HV_ON",{"$f":"VLOOKUP(G67,List!B:C,2,0)","v":1702},null,null,{"$f":"VLOOKUP(G67,List!B:E,4,0)","v":"dcsm-EF_MEA1_HV_ON"},{"$f":"VLOOKUP(G67,List!B:G,6,0)","v":27},"2022-04-15T20:40:43","0000    CALL dcsm-EF_MEA1_HV_ON -Run",null,null,1.9699074073287193E-2,1.9699074073287193E-2,4.8611110833007842E-4]
[null,null,"2022-04-15T21:14:22","2022-04-15T21:15:04",null,"TLM mode change (MODE_5)","TLM_MODE_5",{"$f":"VLOOKUP(G68,List!B:C,2,0)","v":42},null,null,{"$f":"VLOOKUP(G68,List!B:E,4,0)","v":"dcsm-EF_BUS_TLM_MODE_5"},{"$f":"VLOOKUP(G68,List!B:G,6,0)","v":2},"2022-04-15T21:09:05","0000    CALL dcsm-EF_BUS_TLM_MODE_5 -Run",null,null,4.8611110833007842E-4,4.8611110833007842E-4,0.84947916667442769]
[null,null,"2022-04-15T21:15:04",{"$f":"C70","v":"2022-04-16T17:38:19"},"Observation F",null,null,{"$f":"(D69-C69)*3600*24","v":73395.000000670552},{"$f":"H69/3600","v":20.387500000186265},null,null,0,"2022-04-15T21:09:47",{"$f":"\"0000    WAIT_SEC  \"&TEXT(H69,\"#0\")","v":"0000    WAIT_SEC  73395"},null,null,0.84947916667442769,0.84947916667442769,4.8611110833007842E-4]
[null,null,{"$f":"D70-H70/3600/24","v":"2022-04-16T17:38:19"},{"$f":"C71","v":"2022-04-16T17:39:01"},null,"TLM mode change (MODE_10)","TLM_MODE_10",{"$f":"VLOOKUP(G70,List!B:C,2,0)","v":42},null,null,{"$f":"VLOOKUP(G70,List!B:E,4,0)","v":"dcsm-EF_BUS_TLM_MODE_10"},{"$f":"VLOOKUP(G70,List!B:G,6,0)","v":2},{"$f":"C70-317/3600/24","v":"2022-04-16T17:33:02"},{"$f":"+\"0000    CALL \"&K70&\" -Run\"","v":"0000    CALL dcsm-EF_BUS_TLM_MODE_10 -Run"},null,null,4.8611110833007842E-4,4.8611110833007842E-4,2.1990740715409629E-3]
[null,null,{"$f":"D71-H71/3600/24","v":"2022-04-16T17:39:01"},{"$f":"C72","v":"2022-04-16T17:42:11"},null,"SI HV OFF","HEP_HV_OFF",{"$f":"VLOOKUP(G71,List!B:C,2,0)","v":190},null,null,{"$f":"VLOOKUP(G71,List!B:E,4,0)","v":"dcsm-EF_HEPE_HV_OFF_OBS_OFF"},{"$f":"VLOOKUP(G71,List!B:G,6,0)","v":5},"2022-04-16T17:33:44","0000    CALL dcsm-EF_HEPE_HV_OFF_OBS_OFF -Run",null,null,{"$f":"+D71-C71","v":2.1990740715409629E-3},{"$f":"+C72-C71","v":2.1990740715409629E-3},2.2916666639503092E-3]
[null,null,{"$f":"D72-H72/3600/24","v":"2022-04-16T17:42:11"},{"$f":"C73","v":"2022-04-16T17:45:29"},null,null,"ENA_HV_OFF",{"$f":"VLOOKUP(G72,List!B:C,2,0)","v":198},null,null,{"$f":"VLOOKUP(G72,List!B:E,4,0)","v":"dcsm-EF_ENA_HV_OFF"},{"$f":"VLOOKUP(G72,List!B:G,6,0)","v":4},"2022-04-16T17:36:54","0000    CALL dcsm-EF_ENA_HV_OFF -Run",null,null,2.2916666639503092E-3,2.2916666639503092E-3,2.1064814791316167E-3]
[null,null,{"$f":"D73-H73/3600/24","v":"2022-04-16T17:45:29"},{"$f":"C74","v":"2022-04-16T17:48:31"},null,null,"MEA1_HV_OFF",{"$f":"VLOOKUP(G73,List!B:C,2,0)","v":182},null,null,{"$f":"VLOOKUP(G73,List!B:E,4,0)","v":"dcsm-EF_MEA1_HV_OFF"},{"$f":"VLOOKUP(G73,List!B:G,6,0)","v":10},"2022-04-16T17:40:12","0000    CALL dcsm-EF_MEA1_HV_OFF -Run",null,null,2.1064814791316167E-3,2.1064814791316167E-3,1.3888888890505768E-2]
[null,null,"2022-04-16T17:48:31",{"$f":"C74+H74/3600/24","v":"2022-04-16T18:08:31"},"WOL#6",null,{"$f":"(C75-D73)*24*3600","v":1800.0000002095476},1200,null,null,null,0,"2022-04-16T17:43:14",{"$f":"\"0000    WAIT_SEC  \"&TEXT(G74,\"#0\")","v":"0000    WAIT_SEC  1800"},null,null,1.3888888890505768E-2,2.0833333335758653E-2,1.0069444448163267E-2]
[null,null,{"$f":"D74+10/60/24","v":"2022-04-16T18:18:31"},{"$f":"C75+H75/3600/24","v":"2022-04-16T18:23:01"},null,"SI HV ON","HEP_HV_ON",{"$f":"VLOOKUP(G75,List!B:C,2,0)","v":270},null,null,{"$f":"VLOOKUP(G75,List!B:E,4,0)","v":"dcsm-EF_HEPE_HV_ON_OBS_START"},{"$f":"VLOOKUP(G75,List!B:G,6,0)","v":6},"2022-04-16T18:13:14",{"$f":"+\"0000    CALL \"&K75&\" -Run\"","v":"0000    CALL dcsm-EF_HEPE_HV_ON_OBS_START -Run"},null,null,3.125000002910383E-3,3.125000002910383E-3,3.9814814808778465E-3]
[null,null,{"$f":"D75","v":"2022-04-16T18:23:01"},"2022-04-16T18:28:45",null,null,"ENA_HV_ON_CNT",{"$f":"VLOOKUP(G76,List!B:C,2,0)","v":344},null,null,{"$f":"VLOOKUP(G76,List!B:E,4,0)","v":"dcsm-EF_ENA_HV_ON_CNT"},{"$f":"VLOOKUP(G76,List!B:G,6,0)","v":18},"2022-04-16T18:17:44",{"$f":"+\"0000    CALL \"&K76&\" -Run\"","v":"0000    CALL dcsm-EF_ENA_HV_ON_CNT -Run"},null,null,3.9814814808778465E-3,3.9814814808778465E-3,1.9699074073287193E-2]
[null,null,"2022-04-16T18:28:45","2022-04-16T18:57:07",null,null,"MEA1_HV_ON",{"$f":"VLOOKUP(G77,List!B:C,2,0)","v":1702},null,null,{"$f":"VLOOKUP(G77,List!B:E,4,0)","v":"dcsm-EF_MEA1_HV_ON"},{"$f":"VLOOKUP(G77,List!B:G,6,0)","v":27},"2022-04-16T18:23:28","0000    CALL dcsm-EF_MEA1_HV_ON -Run",null,null,1.9699074073287193E-2,1.9699074073287193E-2,4.8611110833007842E-4]
[null,null,"2022-04-16T18:57:07","2022-04-16T18:57:49",null,"TLM mode change (MODE_5)","TLM_MODE_5",{"$f":"VLOOKUP(G78,List!B:C,2,0)","v":42},null,null,{"$f":"VLOOKUP(G78,List!B:E,4,0)","v":"dcsm-EF_BUS_TLM_MODE_5"},{"$f":"VLOOKUP(G78,List!B:G,6,0)","v":2},"2022-04-16T18:51:50","0000    CALL dcsm-EF_BUS_TLM_MODE_5 -Run",null,null,4.8611110833007842E-4,4.8611110833007842E-4,0.92122685186041053]
[null,null,"2022-04-16T18:57:49",{"$f":"C80","v":"2022-04-17T17:04:23"},"Observation G",null,null,{"$f":"(D79-C79)*3600*24","v":79594.00000073947},{"$f":"H79/3600","v":22.109444444649853},null,null,0,"2022-04-16T18:52:32",{"$f":"\"0000    WAIT_SEC  \"&TEXT(H79,\"#0\")","v":"0000    WAIT_SEC  79594"},null,null,0.92122685186041053,0.92122685186041053,4.8611110833007842E-4]
[null,null,{"$f":"D80-H80/3600/24","v":"2022-04-17T17:04:23"},{"$f":"C81","v":"2022-04-17T17:05:05"},null,"TLM mode change (MODE_10)","TLM_MODE_10",{"$f":"VLOOKUP(G80,List!B:C,2,0)","v":42},null,null,{"$f":"VLOOKUP(G80,List!B:E,4,0)","v":"dcsm-EF_BUS_TLM_MODE_10"},{"$f":"VLOOKUP(G80,List!B:G,6,0)","v":2},"2022-04-17T16:59:06",{"$f":"+\"0000    CALL \"&K80&\" -Run\"","v":"0000    CALL dcsm-EF_BUS_TLM_MODE_10 -Run"},null,null,4.8611110833007842E-4,4.8611110833007842E-4,2.1990740715409629E-3]
[null,null,{"$f":"D81-H81/3600/24","v":"2022-04-17T17:05:05"},{"$f":"C82","v":"2022-04-17T17:08:15"},null,"SI HV OFF","HEP_HV_OFF",{"$f":"VLOOKUP(G81,List!B:C,2,0)","v":190},null,null,{"$f":"VLOOKUP(G81,List!B:E,4,0)","v":"dcsm-EF_HEPE_HV_OFF_OBS_OFF"},{"$f":"VLOOKUP(G81,List!B:G,6,0)","v":5},"2022-04-17T16:59:48","0000    CALL dcsm-EF_HEPE_HV_OFF_OBS_OFF -Run",null,null,2.1990740715409629E-3,2.1990740715409629E-3,2.2916666639503092E-3]
[null,null,{"$f":"D82-H82/3600/24","v":"2022-04-17T17:08:15"},{"$f":"C83","v":"2022-04-17T17:11:33"},null,null,"ENA_HV_OFF",{"$f":"VLOOKUP(G82,List!B:C,2,0)","v":198},null,null,{"$f":"VLOOKUP(G82,List!B:E,4,0)","v":"dcsm-EF_ENA_HV_OFF"},{"$f":"VLOOKUP(G82,List!B:G,6,0)","v":4},"2022-04-17T17:02:58","0000    CALL dcsm-EF_ENA_HV_OFF -Run",null,null,2.2916666639503092E-3,2.2916666639503092E-3,2.1064814791316167E-3]
[null,null,{"$f":"D83-H83/3600/24","v":"2022-04-17T17:11:33"},{"$f":"C84","v":"2022-04-17T17:14:35"},null,null,"MEA1_HV_OFF",{"$f":"VLOOKUP(G83,List!B:C,2,0)","v":182},null,null,{"$f":"VLOOKUP(G83,List!B:E,4,0)","v":"dcsm-EF_MEA1_HV_OFF"},{"$f":"VLOOKUP(G83,List!B:G,6,0)","v":10},"2022-04-17T17:06:16","0000    CALL dcsm-EF_MEA1_HV_OFF -Run",null,null,2.1064814791316167E-3,2.1064814791316167E-3,1.3888888890505768E-2]
[null,null,"2022-04-17T17:14:35",{"$f":"C84+H84/3600/24","v":"2022-04-17T17:34:35"},"WOL#7",null,{"$f":"(C85-D83)*24*3600","v":1800.0000002095476},1200,null,null,null,0,"2022-04-17T17:09:18",{"$f":"\"0000    WAIT_SEC  \"&TEXT(G84,\"#0\")","v":"0000    WAIT_SEC  1800"},null,null,1.3888888890505768E-2,2.0833333335758653E-2,1.0069444448163267E-2]
[null,null,{"$f":"D84+10/60/24","v":"2022-04-17T17:44:35"},{"$f":"C85+H85/3600/24","v":"2022-04-17T17:49:05"},null,"SI HV ON","HEP_HV_ON",{"$f":"VLOOKUP(G85,List!B:C,2,0)","v":270},null,null,{"$f":"VLOOKUP(G85,List!B:E,4,0)","v":"dcsm-EF_HEPE_HV_ON_OBS_START"},{"$f":"VLOOKUP(G85,List!B:G,6,0)","v":6},"2022-04-17T17:39:18",{"$f":"+\"0000    CALL \"&K85&\" -Run\"","v":"0000    CALL dcsm-EF_HEPE_HV_ON_OBS_START -Run"},null,null,3.125000002910383E-3,3.125000002910383E-3,3.9814814808778465E-3]
[null,null,{"$f":"D85","v":"2022-04-17T17:49:05"},"2022-04-17T17:54:49",null,null,"ENA_HV_ON_CNT",{"$f":"VLOOKUP(G86,List!B:C,2,0)","v":344},null,null,{"$f":"VLOOKUP(G86,List!B:E,4,0)","v":"dcsm-EF_ENA_HV_ON_CNT"},{"$f":"VLOOKUP(G86,List!B:G,6,0)","v":18},"2022-04-17T17:43:48",{"$f":"+\"0000    CALL \"&K86&\" -Run\"","v":"0000    CALL dcsm-EF_ENA_HV_ON_CNT -Run"},null,null,3.9814814808778465E-3,3.9814814808778465E-3,1.9699074073287193E-2]
[null,null,"2022-04-17T17:54:49","2022-04-17T18:23:11",null,null,"MEA1_HV_ON",{"$f":"VLOOKUP(G87,List!B:C,2,0)","v":1702},null,null,{"$f":"VLOOKUP(G87,List!B:E,4,0)","v":"dcsm-EF_MEA1_HV_ON"},{"$f":"VLOOKUP(G87,List!B:G,6,0)","v":27},"2022-04-17T17:49:32","0000    CALL dcsm-EF_MEA1_HV_ON -Run",null,null,1.9699074073287193E-2,1.9699074073287193E-2,4.8611110833007842E-4]
[null,null,"2022-04-17T18:23:11","2022-04-17T18:23:53",null,"TLM mode change (MODE_5)","TLM_MODE_5",{"$f":"VLOOKUP(G88,List!B:C,2,0)","v":42},null,null,{"$f":"VLOOKUP(G88,List!B:E,4,0)","v":"dcsm-EF_BUS_TLM_MODE_5"},{"$f":"VLOOKUP(G88,List!B:G,6,0)","v":2},"2022-04-17T18:17:54","0000    CALL dcsm-EF_BUS_TLM_MODE_5 -Run",null,null,4.8611110833007842E-4,4.8611110833007842E-4,0.96097222223033896]
[null,null,"2022-04-17T18:23:53",{"$f":"C90","v":"2022-04-18T17:27:41"},"Observation H",null,null,{"$f":"(D89-C89)*3600*24","v":83028.000000701286},{"$f":"H89/3600","v":23.063333333528135},null,null,0,"2022-04-17T18:18:36",{"$f":"\"0000    WAIT_SEC  \"&TEXT(H89,\"#0\")","v":"0000    WAIT_SEC  83028"},null,null,0.96097222223033896,0.96097222223033896,4.8611110833007842E-4]
[null,null,{"$f":"D90-H90/3600/24","v":"2022-04-18T17:27:41"},{"$f":"C91","v":"2022-04-18T17:28:23"},null,"TLM mode change (MODE_10)","TLM_MODE_10",{"$f":"VLOOKUP(G90,List!B:C,2,0)","v":42},null,null,{"$f":"VLOOKUP(G90,List!B:E,4,0)","v":"dcsm-EF_BUS_TLM_MODE_10"},{"$f":"VLOOKUP(G90,List!B:G,6,0)","v":2},"2022-04-18T17:22:24",{"$f":"+\"0000    CALL \"&K90&\" -Run\"","v":"0000    CALL dcsm-EF_BUS_TLM_MODE_10 -Run"},null,null,4.8611110833007842E-4,4.8611110833007842E-4,2.1990740715409629E-3]
[null,null,{"$f":"D91-H91/3600/24","v":"2022-04-18T17:28:23"},{"$f":"C92","v":"2022-04-18T17:31:33"},null,"SI HV OFF","HEP_HV_OFF",{"$f":"VLOOKUP(G91,List!B:C,2,0)","v":190},null,null,{"$f":"VLOOKUP(G91,List!B:E,4,0)","v":"dcsm-EF_HEPE_HV_OFF_OBS_OFF"},{"$f":"VLOOKUP(G91,List!B:G,6,0)","v":5},"2022-04-18T17:23:06","0000    CALL dcsm-EF_HEPE_HV_OFF_OBS_OFF -Run",null,null,2.1990740715409629E-3,2.1990740715409629E-3,2.2916666639503092E-3]
[null,null,{"$f":"D92-H92/3600/24","v":"2022-04-18T17:31:33"},{"$f":"C93","v":"2022-04-18T17:34:51"},null,null,"ENA_HV_OFF",{"$f":"VLOOKUP(G92,List!B:C,2,0)","v":198},null,null,{"$f":"VLOOKUP(G92,List!B:E,4,0)","v":"dcsm-EF_ENA_HV_OFF"},{"$f":"VLOOKUP(G92,List!B:G,6,0)","v":4},"2022-04-18T17:26:16","0000    CALL dcsm-EF_ENA_HV_OFF -Run",null,null,2.2916666639503092E-3,2.2916666639503092E-3,2.1064814791316167E-3]
[null,null,{"$f":"D93-H93/3600/24","v":"2022-04-18T17:34:51"},{"$f":"C94","v":"2022-04-18T17:37:53"},null,null,"MEA1_HV_OFF",{"$f":"VLOOKUP(G93,List!B:C,2,0)","v":182},null,null,{"$f":"VLOOKUP(G93,List!B:E,4,0)","v":"dcsm-EF_MEA1_HV_OFF"},{"$f":"VLOOKUP(G93,List!B:G,6,0)","v":10},"2022-04-18T17:29:34","0000    CALL dcsm-EF_MEA1_HV_OFF -Run",null,null,2.1064814791316167E-3,2.1064814791316167E-3,1.3888888890505768E-2]
[null,null,"2022-04-18T17:37:53",{"$f":"C94+H94/3600/24","v":"2022-04-18T17:57:53"},"WOL#8",null,{"$f":"(C95-D93)*24*3600","v":1800.0000002095476},1200,null,null,null,0,"2022-04-18T17:32:36",{"$f":"\"0000    WAIT_SEC  \"&TEXT(G94,\"#0\")","v":"0000    WAIT_SEC  1800"},null,null,1.3888888890505768E-2,2.0833333335758653E-2,1.0069444448163267E-2]
[null,null,{"$f":"D94+10/60/24","v":"2022-04-18T18:07:53"},{"$f":"C95+H95/3600/24","v":"2022-04-18T18:12:23"},null,"SI HV ON","HEP_HV_ON",{"$f":"VLOOKUP(G95,List!B:C,2,0)","v":270},null,null,{"$f":"VLOOKUP(G95,List!B:E,4,0)","v":"dcsm-EF_HEPE_HV_ON_OBS_START"},{"$f":"VLOOKUP(G95,List!B:G,6,0)","v":6},"2022-04-18T18:02:36",{"$f":"+\"0000    CALL \"&K95&\" -Run\"","v":"0000    CALL dcsm-EF_HEPE_HV_ON_OBS_START -Run"},null,null,3.125000002910383E-3,3.125000002910383E-3,3.9814814808778465E-3]
[null,null,{"$f":"D95","v":"2022-04-18T18:12:23"},"2022-04-18T18:18:07",null,null,"ENA_HV_ON_CNT",{"$f":"VLOOKUP(G96,List!B:C,2,0)","v":344},null,null,{"$f":"VLOOKUP(G96,List!B:E,4,0)","v":"dcsm-EF_ENA_HV_ON_CNT"},{"$f":"VLOOKUP(G96,List!B:G,6,0)","v":18},"2022-04-18T18:07:06",{"$f":"+\"0000    CALL \"&K96&\" -Run\"","v":"0000    CALL dcsm-EF_ENA_HV_ON_CNT -Run"},null,null,3.9814814808778465E-3,3.9814814808778465E-3,1.9699074073287193E-2]
[null,null,"2022-04-18T18:18:07","2022-04-18T18:46:29",null,null,"MEA1_HV_ON",{"$f":"VLOOKUP(G97,List!B:C,2,0)","v":1702},null,null,{"$f":"VLOOKUP(G97,List!B:E,4,0)","v":"dcsm-EF_MEA1_HV_ON"},{"$f":"VLOOKUP(G97,List!B:G,6,0)","v":27},"2022-04-18T18:12:50","0000    CALL dcsm-EF_MEA1_HV_ON -Run",null,null,1.9699074073287193E-2,1.9699074073287193E-2,4.8611110833007842E-4]
[null,null,"2022-04-18T18:46:29","2022-04-18T18:47:11",null,"TLM mode change (MODE_5)","TLM_MODE_5",{"$f":"VLOOKUP(G98,List!B:C,2,0)","v":42},null,null,{"$f":"VLOOKUP(G98,List!B:E,4,0)","v":"dcsm-EF_BUS_TLM_MODE_5"},{"$f":"VLOOKUP(G98,List!B:G,6,0)","v":2},"2022-04-18T18:41:12","0000    CALL dcsm-EF_BUS_TLM_MODE_5 -Run",null,null,4.8611110833007842E-4,4.8611110833007842E-4,0.96810185186768649]
[null,null,"2022-04-18T18:47:11",{"$f":"C100","v":"2022-04-19T18:01:15"},"Observation I",null,null,{"$f":"(D99-C99)*3600*24","v":83644.000001368113},{"$f":"H99/3600","v":23.234444444824476},null,null,0,"2022-04-18T18:41:54",{"$f":"\"0000    WAIT_SEC  \"&TEXT(H99,\"#0\")","v":"0000    WAIT_SEC  83644"},null,null,0.96810185186768649,0.96810185186768649,4.8611110833007842E-4]
[null,null,{"$f":"D100-H100/3600/24","v":"2022-04-19T18:01:15"},{"$f":"C101","v":"2022-04-19T18:01:57"},null,"TLM mode change (MODE_10)","TLM_MODE_10",{"$f":"VLOOKUP(G100,List!B:C,2,0)","v":42},null,null,{"$f":"VLOOKUP(G100,List!B:E,4,0)","v":"dcsm-EF_BUS_TLM_MODE_10"},{"$f":"VLOOKUP(G100,List!B:G,6,0)","v":2},"2022-04-19T17:55:58",{"$f":"+\"0000    CALL \"&K100&\" -Run\"","v":"0000    CALL dcsm-EF_BUS_TLM_MODE_10 -Run"},null,null,4.8611110833007842E-4,4.8611110833007842E-4,2.1990740715409629E-3]
[null,null,{"$f":"D101-H101/3600/24","v":"2022-04-19T18:01:57"},{"$f":"C102","v":"2022-04-19T18:05:07"},null,"SI HV OFF","HEP_HV_OFF",{"$f":"VLOOKUP(G101,List!B:C,2,0)","v":190},null,null,{"$f":"VLOOKUP(G101,List!B:E,4,0)","v":"dcsm-EF_HEPE_HV_OFF_OBS_OFF"},{"$f":"VLOOKUP(G101,List!B:G,6,0)","v":5},"2022-04-19T17:56:40","0000    CALL dcsm-EF_HEPE_HV_OFF_OBS_OFF -Run",null,null,2.1990740715409629E-3,2.1990740715409629E-3,2.2916666639503092E-3]
[null,null,{"$f":"D102-H102/3600/24","v":"2022-04-19T18:05:07"},{"$f":"C103","v":"2022-04-19T18:08:25"},null,null,"ENA_HV_OFF",{"$f":"VLOOKUP(G102,List!B:C,2,0)","v":198},null,null,{"$f":"VLOOKUP(G102,List!B:E,4,0)","v":"dcsm-EF_ENA_HV_OFF"},{"$f":"VLOOKUP(G102,List!B:G,6,0)","v":4},"2022-04-19T17:59:50","0000    CALL dcsm-EF_ENA_HV_OFF -Run",null,null,2.2916666639503092E-3,2.2916666639503092E-3,2.1064814791316167E-3]
[null,null,{"$f":"D103-H103/3600/24","v":"2022-04-19T18:08:25"},{"$f":"C104","v":"2022-04-19T18:11:27"},null,null,"MEA1_HV_OFF",{"$f":"VLOOKUP(G103,List!B:C,2,0)","v":182},null,null,{"$f":"VLOOKUP(G103,List!B:E,4,0)","v":"dcsm-EF_MEA1_HV_OFF"},{"$f":"VLOOKUP(G103,List!B:G,6,0)","v":10},"2022-04-19T18:03:08","0000    CALL dcsm-EF_MEA1_HV_OFF -Run",null,null,2.1064814791316167E-3,2.1064814791316167E-3,1.3888888890505768E-2]
[null,null,"2022-04-19T18:11:27",{"$f":"C104+H104/3600/24","v":"2022-04-19T18:31:27"},"WOL#9",null,{"$f":"(C105-D103)*24*3600","v":1800.0000002095476},1200,null,null,null,0,"2022-04-19T18:06:10",{"$f":"\"0000    WAIT_SEC  \"&TEXT(G104,\"#0\")","v":"0000    WAIT_SEC  1800"},null,null,1.3888888890505768E-2,2.0833333335758653E-2,1.0069444448163267E-2]
[null,null,{"$f":"D104+10/60/24","v":"2022-04-19T18:41:27"},{"$f":"C105+H105/3600/24","v":"2022-04-19T18:45:57"},null,"SI HV ON","HEP_HV_ON",{"$f":"VLOOKUP(G105,List!B:C,2,0)","v":270},null,null,{"$f":"VLOOKUP(G105,List!B:E,4,0)","v":"dcsm-EF_HEPE_HV_ON_OBS_START"},{"$f":"VLOOKUP(G105,List!B:G,6,0)","v":6},"2022-04-19T18:36:10",{"$f":"+\"0000    CALL \"&K105&\" -Run\"","v":"0000    CALL dcsm-EF_HEPE_HV_ON_OBS_START -Run"},null,null,3.125000002910383E-3,3.125000002910383E-3,3.9814814808778465E-3]
[null,null,{"$f":"D105","v":"2022-04-19T18:45:57"},"2022-04-19T18:51:41",null,null,"ENA_HV_ON_CNT",{"$f":"VLOOKUP(G106,List!B:C,2,0)","v":344},null,null,{"$f":"VLOOKUP(G106,List!B:E,4,0)","v":"dcsm-EF_ENA_HV_ON_CNT"},{"$f":"VLOOKUP(G106,List!B:G,6,0)","v":18},"2022-04-19T18:40:40",{"$f":"+\"0000    CALL \"&K106&\" -Run\"","v":"0000    CALL dcsm-EF_ENA_HV_ON_CNT -Run"},null,null,3.9814814808778465E-3,3.9814814808778465E-3,1.9699074073287193E-2]
[null,null,"2022-04-19T18:51:41","2022-04-19T19:20:03",null,null,"MEA1_HV_ON",{"$f":"VLOOKUP(G107,List!B:C,2,0)","v":1702},null,null,{"$f":"VLOOKUP(G107,List!B:E,4,0)","v":"dcsm-EF_MEA1_HV_ON"},{"$f":"VLOOKUP(G107,List!B:G,6,0)","v":27},"2022-04-19T18:46:24","0000    CALL dcsm-EF_MEA1_HV_ON -Run",null,null,1.9699074073287193E-2,1.9699074073287193E-2,4.8611110833007842E-4]
[null,null,"2022-04-19T19:20:03","2022-04-19T19:20:45",null,"TLM mode change (MODE_5)","TLM_MODE_5",{"$f":"VLOOKUP(G108,List!B:C,2,0)","v":42},null,null,{"$f":"VLOOKUP(G108,List!B:E,4,0)","v":"dcsm-EF_BUS_TLM_MODE_5"},{"$f":"VLOOKUP(G108,List!B:G,6,0)","v":2},"2022-04-19T19:14:46","0000    CALL dcsm-EF_BUS_TLM_MODE_5 -Run",null,null,4.8611110833007842E-4,4.8611110833007842E-4,1.0553935185234877]
[null,null,"2022-04-19T19:20:45",{"$f":"C110","v":"2022-04-20T20:40:31"},"Observation J",null,null,{"$f":"(D109-C109)*3600*24","v":91186.00000042934},{"$f":"H109/3600","v":25.329444444563705},null,null,0,"2022-04-19T19:15:28",{"$f":"\"0000    WAIT_SEC  \"&TEXT(H109,\"#0\")","v":"0000    WAIT_SEC  91186"},null,null,1.0553935185234877,1.0553935185234877,4.8611110833007842E-4]
[null,null,{"$f":"D110-H110/3600/24","v":"2022-04-20T20:40:31"},{"$f":"C111","v":"2022-04-20T20:41:13"},null,"TLM mode change (MODE_10)","TLM_MODE_10",{"$f":"VLOOKUP(G110,List!B:C,2,0)","v":42},null,null,{"$f":"VLOOKUP(G110,List!B:E,4,0)","v":"dcsm-EF_BUS_TLM_MODE_10"},{"$f":"VLOOKUP(G110,List!B:G,6,0)","v":2},"2022-04-20T20:35:14",{"$f":"+\"0000    CALL \"&K110&\" -Run\"","v":"0000    CALL dcsm-EF_BUS_TLM_MODE_10 -Run"},null,null,4.8611110833007842E-4,4.8611110833007842E-4,2.1990740715409629E-3]
[null,null,{"$f":"D111-H111/3600/24","v":"2022-04-20T20:41:13"},{"$f":"C112","v":"2022-04-20T20:44:23"},null,"SI HV OFF","HEP_HV_OFF",{"$f":"VLOOKUP(G111,List!B:C,2,0)","v":190},null,null,{"$f":"VLOOKUP(G111,List!B:E,4,0)","v":"dcsm-EF_HEPE_HV_OFF_OBS_OFF"},{"$f":"VLOOKUP(G111,List!B:G,6,0)","v":5},"2022-04-20T20:35:56","0000    CALL dcsm-EF_HEPE_HV_OFF_OBS_OFF -Run",null,null,2.1990740715409629E-3,2.1990740715409629E-3,2.2916666639503092E-3]
[null,null,{"$f":"D112-H112/3600/24","v":"2022-04-20T20:44:23"},{"$f":"C113","v":"2022-04-20T20:47:41"},null,null,"ENA_HV_OFF",{"$f":"VLOOKUP(G112,List!B:C,2,0)","v":198},null,null,{"$f":"VLOOKUP(G112,List!B:E,4,0)","v":"dcsm-EF_ENA_HV_OFF"},{"$f":"VLOOKUP(G112,List!B:G,6,0)","v":4},"2022-04-20T20:39:06","0000    CALL dcsm-EF_ENA_HV_OFF -Run",null,null,2.2916666639503092E-3,2.2916666639503092E-3,2.1064814791316167E-3]
[null,null,{"$f":"D113-H113/3600/24","v":"2022-04-20T20:47:41"},{"$f":"C114","v":"2022-04-20T20:50:43"},null,null,"MEA1_HV_OFF",{"$f":"VLOOKUP(G113,List!B:C,2,0)","v":182},null,null,{"$f":"VLOOKUP(G113,List!B:E,4,0)","v":"dcsm-EF_MEA1_HV_OFF"},{"$f":"VLOOKUP(G113,List!B:G,6,0)","v":10},"2022-04-20T20:42:24","0000    CALL dcsm-EF_MEA1_HV_OFF -Run",null,null,2.1064814791316167E-3,2.1064814791316167E-3,1.3888888890505768E-2]
[null,null,"2022-04-20T20:50:43",{"$f":"C114+H114/3600/24","v":"2022-04-20T21:10:43"},"WOL#10",null,{"$f":"(C115-D113)*24*3600","v":1800.0000002095476},1200,null,null,null,0,"2022-04-20T20:45:26",{"$f":"\"0000    WAIT_SEC  \"&TEXT(G114,\"#0\")","v":"0000    WAIT_SEC  1800"},null,null,1.3888888890505768E-2,2.0833333335758653E-2,1.0069444448163267E-2]
[null,null,{"$f":"D114+10/60/24","v":"2022-04-20T21:20:43"},{"$f":"C115+H115/3600/24","v":"2022-04-20T21:25:13"},null,"SI HV ON","HEP_HV_ON",{"$f":"VLOOKUP(G115,List!B:C,2,0)","v":270},null,null,{"$f":"VLOOKUP(G115,List!B:E,4,0)","v":"dcsm-EF_HEPE_HV_ON_OBS_START"},{"$f":"VLOOKUP(G115,List!B:G,6,0)","v":6},"2022-04-20T21:15:26",{"$f":"+\"0000    CALL \"&K115&\" -Run\"","v":"0000    CALL dcsm-EF_HEPE_HV_ON_OBS_START -Run"},null,null,3.125000002910383E-3,3.125000002910383E-3,3.9814814808778465E-3]
[null,null,{"$f":"D115","v":"2022-04-20T21:25:13"},"2022-04-20T21:30:57",null,null,"ENA_HV_ON_CNT",{"$f":"VLOOKUP(G116,List!B:C,2,0)","v":344},null,null,{"$f":"VLOOKUP(G116,List!B:E,4,0)","v":"dcsm-EF_ENA_HV_ON_CNT"},{"$f":"VLOOKUP(G116,List!B:G,6,0)","v":18},"2022-04-20T21:19:56",{"$f":"+\"0000    CALL \"&K116&\" -Run\"","v":"0000    CALL dcsm-EF_ENA_HV_ON_CNT -Run"},null,null,3.9814814808778465E-3,3.9814814808778465E-3,1.9699074073287193E-2]
[null,null,"2022-04-20T21:30:57","2022-04-20T21:59:19",null,null,"MEA1_HV_ON",{"$f":"VLOOKUP(G117,List!B:C,2,0)","v":1702},null,null,{"$f":"VLOOKUP(G117,List!B:E,4,0)","v":"dcsm-EF_MEA1_HV_ON"},{"$f":"VLOOKUP(G117,List!B:G,6,0)","v":27},"2022-04-20T21:25:40","0000    CALL dcsm-EF_MEA1_HV_ON -Run",null,null,1.9699074073287193E-2,1.9699074073287193E-2,4.8611110833007842E-4]
[null,null,"2022-04-20T21:59:19","2022-04-20T22:00:01",null,"TLM mode change (MODE_5)","TLM_MODE_5",{"$f":"VLOOKUP(G118,List!B:C,2,0)","v":42},null,null,{"$f":"VLOOKUP(G118,List!B:E,4,0)","v":"dcsm-EF_BUS_TLM_MODE_5"},{"$f":"VLOOKUP(G118,List!B:G,6,0)","v":2},"2022-04-20T21:54:02","0000    CALL dcsm-EF_BUS_TLM_MODE_5 -Run",null,null,4.8611110833007842E-4,4.8611110833007842E-4,0.98826388889574446]
[null,null,"2022-04-20T22:00:01",{"$f":"C120","v":"2022-04-21T21:43:07"},"Observation K",null,null,{"$f":"(D119-C119)*3600*24","v":85386.000000592321},{"$f":"H119/3600","v":23.718333333497867},null,null,0,"2022-04-20T21:54:44",{"$f":"\"0000    WAIT_SEC  \"&TEXT(H119,\"#0\")","v":"0000    WAIT_SEC  85386"},null,null,0.98826388889574446,0.98826388889574446,4.8611110833007842E-4]
[null,null,{"$f":"D120-H120/3600/24","v":"2022-04-21T21:43:07"},{"$f":"C121","v":"2022-04-21T21:43:49"},null,"TLM mode change (MODE_10)","TLM_MODE_10",{"$f":"VLOOKUP(G120,List!B:C,2,0)","v":42},null,null,{"$f":"VLOOKUP(G120,List!B:E,4,0)","v":"dcsm-EF_BUS_TLM_MODE_10"},{"$f":"VLOOKUP(G120,List!B:G,6,0)","v":2},"2022-04-21T21:37:50",{"$f":"+\"0000    CALL \"&K120&\" -Run\"","v":"0000    CALL dcsm-EF_BUS_TLM_MODE_10 -Run"},null,null,4.8611110833007842E-4,4.8611110833007842E-4,2.1990740715409629E-3]
[null,null,{"$f":"D121-H121/3600/24","v":"2022-04-21T21:43:49"},{"$f":"C122","v":"2022-04-21T21:46:59"},null,"SI HV OFF","HEP_HV_OFF",{"$f":"VLOOKUP(G121,List!B:C,2,0)","v":190},null,null,{"$f":"VLOOKUP(G121,List!B:E,4,0)","v":"dcsm-EF_HEPE_HV_OFF_OBS_OFF"},{"$f":"VLOOKUP(G121,List!B:G,6,0)","v":5},"2022-04-21T21:38:32","0000    CALL dcsm-EF_HEPE_HV_OFF_OBS_OFF -Run",null,null,2.1990740715409629E-3,2.1990740715409629E-3,2.2916666639503092E-3]
[null,null,{"$f":"D122-H122/3600/24","v":"2022-04-21T21:46:59"},{"$f":"C123","v":"2022-04-21T21:50:17"},null,null,"ENA_HV_OFF",{"$f":"VLOOKUP(G122,List!B:C,2,0)","v":198},null,null,{"$f":"VLOOKUP(G122,List!B:E,4,0)","v":"dcsm-EF_ENA_HV_OFF"},{"$f":"VLOOKUP(G122,List!B:G,6,0)","v":4},"2022-04-21T21:41:42","0000    CALL dcsm-EF_ENA_HV_OFF -Run",null,null,2.2916666639503092E-3,2.2916666639503092E-3,2.1064814791316167E-3]
[null,null,{"$f":"D123-H123/3600/24","v":"2022-04-21T21:50:17"},{"$f":"C124","v":"2022-04-21T21:53:19"},null,null,"MEA1_HV_OFF",{"$f":"VLOOKUP(G123,List!B:C,2,0)","v":182},null,null,{"$f":"VLOOKUP(G123,List!B:E,4,0)","v":"dcsm-EF_MEA1_HV_OFF"},{"$f":"VLOOKUP(G123,List!B:G,6,0)","v":10},"2022-04-21T21:45:00","0000    CALL dcsm-EF_MEA1_HV_OFF -Run",null,null,2.1064814791316167E-3,2.1064814791316167E-3,1.3888888890505768E-2]
[null,null,"2022-04-21T21:53:19",{"$f":"C124+H124/3600/24","v":"2022-04-21T22:13:19"},"WOL#11",null,{"$f":"(C125-D123)*24*3600","v":1800.0000002095476},1200,null,null,null,0,"2022-04-21T21:48:02",{"$f":"\"0000    WAIT_SEC  \"&TEXT(G124,\"#0\")","v":"0000    WAIT_SEC  1800"},null,null,1.3888888890505768E-2,2.0833333335758653E-2,1.0069444448163267E-2]
[null,null,{"$f":"D124+10/60/24","v":"2022-04-21T22:23:19"},{"$f":"C125+H125/3600/24","v":"2022-04-21T22:27:49"},null,"SI HV ON","HEP_HV_ON",{"$f":"VLOOKUP(G125,List!B:C,2,0)","v":270},null,null,{"$f":"VLOOKUP(G125,List!B:E,4,0)","v":"dcsm-EF_HEPE_HV_ON_OBS_START"},{"$f":"VLOOKUP(G125,List!B:G,6,0)","v":6},"2022-04-21T22:18:02",{"$f":"+\"0000    CALL \"&K125&\" -Run\"","v":"0000    CALL dcsm-EF_HEPE_HV_ON_OBS_START -Run"},null,null,3.125000002910383E-3,3.125000002910383E-3,3.9814814808778465E-3]
[null,null,{"$f":"D125","v":"2022-04-21T22:27:49"},"2022-04-21T22:33:33",null,null,"ENA_HV_ON_CNT",{"$f":"VLOOKUP(G126,List!B:C,2,0)","v":344},null,null,{"$f":"VLOOKUP(G126,List!B:E,4,0)","v":"dcsm-EF_ENA_HV_ON_CNT"},{"$f":"VLOOKUP(G126,List!B:G,6,0)","v":18},"2022-04-21T22:22:32",{"$f":"+\"0000    CALL \"&K126&\" -Run\"","v":"0000    CALL dcsm-EF_ENA_HV_ON_CNT -Run"},null,null,3.9814814808778465E-3,3.9814814808778465E-3,1.9699074073287193E-2]
[null,null,"2022-04-21T22:33:33","2022-04-21T23:01:55",null,null,"MEA1_HV_ON",{"$f":"VLOOKUP(G127,List!B:C,2,0)","v":1702},null,null,{"$f":"VLOOKUP(G127,List!B:E,4,0)","v":"dcsm-EF_MEA1_HV_ON"},{"$f":"VLOOKUP(G127,List!B:G,6,0)","v":27},"2022-04-21T22:28:16","0000    CALL dcsm-EF_MEA1_HV_ON -Run",null,null,1.9699074073287193E-2,1.9699074073287193E-2,4.8611110833007842E-4]
[null,null,"2022-04-21T23:01:55","2022-04-21T23:02:37",null,"TLM mode change (MODE_5)","TLM_MODE_5",{"$f":"VLOOKUP(G128,List!B:C,2,0)","v":42},null,null,{"$f":"VLOOKUP(G128,List!B:E,4,0)","v":"dcsm-EF_BUS_TLM_MODE_5"},{"$f":"VLOOKUP(G128,List!B:G,6,0)","v":2},"2022-04-21T22:56:38","0000    CALL dcsm-EF_BUS_TLM_MODE_5 -Run",null,null,4.8611110833007842E-4,4.8611110833007842E-4,0.85480324075615499]
[null,null,"2022-04-21T23:02:37",{"$f":"C130","v":"2022-04-22T19:33:32"},"Observation L",null,null,{"$f":"(D129-C129)*3600*24","v":73855.000001331791},{"$f":"H129/3600","v":20.51527777814772},null,null,0,"2022-04-21T22:57:20",{"$f":"\"0000    WAIT_SEC  \"&TEXT(H129,\"#0\")","v":"0000    WAIT_SEC  73855"},null,null,0.85480324075615499,0.85480324075615499,4.8611110833007842E-4]
[null,null,{"$f":"D130-H130/3600/24","v":"2022-04-22T19:33:32"},{"$f":"C131","v":"2022-04-22T19:34:14"},null,"TLM mode change (MODE_10)","TLM_MODE_10",{"$f":"VLOOKUP(G130,List!B:C,2,0)","v":42},null,null,{"$f":"VLOOKUP(G130,List!B:E,4,0)","v":"dcsm-EF_BUS_TLM_MODE_10"},{"$f":"VLOOKUP(G130,List!B:G,6,0)","v":2},"2022-04-22T19:28:15",{"$f":"+\"0000    CALL \"&K130&\" -Run\"","v":"0000    CALL dcsm-EF_BUS_TLM_MODE_10 -Run"},null,null,4.8611110833007842E-4,4.8611110833007842E-4,2.1990740715409629E-3]
[null,null,{"$f":"D131-H131/3600/24","v":"2022-04-22T19:34:14"},{"$f":"C132","v":"2022-04-22T19:37:24"},null,"SI HV OFF","HEP_HV_OFF",{"$f":"VLOOKUP(G131,List!B:C,2,0)","v":190},null,null,{"$f":"VLOOKUP(G131,List!B:E,4,0)","v":"dcsm-EF_HEPE_HV_OFF_OBS_OFF"},{"$f":"VLOOKUP(G131,List!B:G,6,0)","v":5},"2022-04-22T19:28:57","0000    CALL dcsm-EF_HEPE_HV_OFF_OBS_OFF -Run",null,null,2.1990740715409629E-3,2.1990740715409629E-3,2.2916666639503092E-3]
[null,null,{"$f":"D132-H132/3600/24","v":"2022-04-22T19:37:24"},{"$f":"C133","v":"2022-04-22T19:40:42"},null,null,"ENA_HV_OFF",{"$f":"VLOOKUP(G132,List!B:C,2,0)","v":198},null,null,{"$f":"VLOOKUP(G132,List!B:E,4,0)","v":"dcsm-EF_ENA_HV_OFF"},{"$f":"VLOOKUP(G132,List!B:G,6,0)","v":4},"2022-04-22T19:32:07","0000    CALL dcsm-EF_ENA_HV_OFF -Run",null,null,2.2916666639503092E-3,2.2916666639503092E-3,2.1064814791316167E-3]
[null,null,{"$f":"D133-H133/3600/24","v":"2022-04-22T19:40:42"},{"$f":"C134","v":"2022-04-22T19:43:44"},null,null,"MEA1_HV_OFF",{"$f":"VLOOKUP(G133,List!B:C,2,0)","v":182},null,null,{"$f":"VLOOKUP(G133,List!B:E,4,0)","v":"dcsm-EF_MEA1_HV_OFF"},{"$f":"VLOOKUP(G133,List!B:G,6,0)","v":10},"2022-04-22T19:35:25","0000    CALL dcsm-EF_MEA1_HV_OFF -Run",null,null,2.1064814791316167E-3,2.1064814791316167E-3,1.3888888890505768E-2]
[null,null,"2022-04-22T19:43:44",{"$f":"C134+H134/3600/24","v":"2022-04-22T20:03:44"},"WOL#12",null,{"$f":"(C135-D133)*24*3600","v":1800.0000002095476},1200,null,null,null,0,{"$f":"C134-317/3600/24","v":"2022-04-22T19:38:27"},{"$f":"\"0000    WAIT_SEC  \"&TEXT(G134,\"#0\")","v":"0000    WAIT_SEC  1800"},null,null,1.3888888890505768E-2,2.0833333335758653E-2,1.0069444448163267E-2]
[null,null,{"$f":"D134+10/60/24","v":"2022-04-22T20:13:44"},{"$f":"C135+H135/3600/24","v":"2022-04-22T20:18:14"},null,"SI HV ON","HEP_HV_ON",{"$f":"VLOOKUP(G135,List!B:C,2,0)","v":270},null,null,{"$f":"VLOOKUP(G135,List!B:E,4,0)","v":"dcsm-EF_HEPE_HV_ON_OBS_START"},{"$f":"VLOOKUP(G135,List!B:G,6,0)","v":6},"2022-04-22T20:08:27",{"$f":"+\"0000    CALL \"&K135&\" -Run\"","v":"0000    CALL dcsm-EF_HEPE_HV_ON_OBS_START -Run"},null,null,{"$f":"+D135-C135","v":3.125000002910383E-3},{"$f":"+C136-C135","v":3.125000002910383E-3},3.9814814808778465E-3]
[null,null,{"$f":"D135","v":"2022-04-22T20:18:14"},"2022-04-22T20:23:58",null,null,"ENA_HV_ON_CNT",{"$f":"VLOOKUP(G136,List!B:C,2,0)","v":344},null,null,{"$f":"VLOOKUP(G136,List!B:E,4,0)","v":"dcsm-EF_ENA_HV_ON_CNT"},{"$f":"VLOOKUP(G136,List!B:G,6,0)","v":18},"2022-04-22T20:12:57",{"$f":"+\"0000    CALL \"&K136&\" -Run\"","v":"0000    CALL dcsm-EF_ENA_HV_ON_CNT -Run"},null,null,3.9814814808778465E-3,3.9814814808778465E-3,1.9699074073287193E-2]
[null,null,"2022-04-22T20:23:58","2022-04-22T20:52:20",null,null,"MEA1_HV_ON",{"$f":"VLOOKUP(G137,List!B:C,2,0)","v":1702},null,null,{"$f":"VLOOKUP(G137,List!B:E,4,0)","v":"dcsm-EF_MEA1_HV_ON"},{"$f":"VLOOKUP(G137,List!B:G,6,0)","v":27},"2022-04-22T20:18:41","0000    CALL dcsm-EF_MEA1_HV_ON -Run",null,null,1.9699074073287193E-2,1.9699074073287193E-2,4.8611110833007842E-4]
[null,null,"2022-04-22T20:52:20","2022-04-22T20:53:02",null,"TLM mode change (MODE_5)","TLM_MODE_5",{"$f":"VLOOKUP(G138,List!B:C,2,0)","v":42},null,null,{"$f":"VLOOKUP(G138,List!B:E,4,0)","v":"dcsm-EF_BUS_TLM_MODE_5"},{"$f":"VLOOKUP(G138,List!B:G,6,0)","v":2},"2022-04-22T20:47:03","0000    CALL dcsm-EF_BUS_TLM_MODE_5 -Run",null,null,4.8611110833007842E-4,4.8611110833007842E-4,0.8777430555637693]
[null,null,"2022-04-22T20:53:02",{"$f":"C140","v":"2022-04-23T17:56:59"},"Observation M",null,null,{"$f":"(D139-C139)*3600*24","v":75837.000000709668},{"$f":"H139/3600","v":21.065833333530463},null,null,0,"2022-04-22T20:47:45",{"$f":"\"0000    WAIT_SEC  \"&TEXT(H139,\"#0\")","v":"0000    WAIT_SEC  75837"},null,null,0.8777430555637693,0.8777430555637693,4.8611110833007842E-4]
[null,null,{"$f":"D140-H140/3600/24","v":"2022-04-23T17:56:59"},{"$f":"C141","v":"2022-04-23T17:57:41"},null,"TLM mode change (MODE_10)","TLM_MODE_10",{"$f":"VLOOKUP(G140,List!B:C,2,0)","v":42},null,null,{"$f":"VLOOKUP(G140,List!B:E,4,0)","v":"dcsm-EF_BUS_TLM_MODE_10"},{"$f":"VLOOKUP(G140,List!B:G,6,0)","v":2},"2022-04-23T17:51:42",{"$f":"+\"0000    CALL \"&K140&\" -Run\"","v":"0000    CALL dcsm-EF_BUS_TLM_MODE_10 -Run"},null,null,4.8611110833007842E-4,4.8611110833007842E-4,2.1990740715409629E-3]
[null,null,{"$f":"D141-H141/3600/24","v":"2022-04-23T17:57:41"},{"$f":"C142","v":"2022-04-23T18:00:51"},null,"SI HV OFF","HEP_HV_OFF",{"$f":"VLOOKUP(G141,List!B:C,2,0)","v":190},null,null,{"$f":"VLOOKUP(G141,List!B:E,4,0)","v":"dcsm-EF_HEPE_HV_OFF_OBS_OFF"},{"$f":"VLOOKUP(G141,List!B:G,6,0)","v":5},"2022-04-23T17:52:24","0000    CALL dcsm-EF_HEPE_HV_OFF_OBS_OFF -Run",null,null,2.1990740715409629E-3,2.1990740715409629E-3,2.2916666639503092E-3]
[null,null,{"$f":"D142-H142/3600/24","v":"2022-04-23T18:00:51"},{"$f":"C143","v":"2022-04-23T18:04:09"},null,null,"ENA_HV_OFF",{"$f":"VLOOKUP(G142,List!B:C,2,0)","v":198},null,null,{"$f":"VLOOKUP(G142,List!B:E,4,0)","v":"dcsm-EF_ENA_HV_OFF"},{"$f":"VLOOKUP(G142,List!B:G,6,0)","v":4},"2022-04-23T17:55:34","0000    CALL dcsm-EF_ENA_HV_OFF -Run",null,null,2.2916666639503092E-3,2.2916666639503092E-3,2.1064814791316167E-3]
[null,null,{"$f":"D143-H143/3600/24","v":"2022-04-23T18:04:09"},{"$f":"C144","v":"2022-04-23T18:07:11"},null,null,"MEA1_HV_OFF",{"$f":"VLOOKUP(G143,List!B:C,2,0)","v":182},null,null,{"$f":"VLOOKUP(G143,List!B:E,4,0)","v":"dcsm-EF_MEA1_HV_OFF"},{"$f":"VLOOKUP(G143,List!B:G,6,0)","v":10},"2022-04-23T17:58:52","0000    CALL dcsm-EF_MEA1_HV_OFF -Run",null,null,2.1064814791316167E-3,2.1064814791316167E-3,1.3888888890505768E-2]
[null,null,"2022-04-23T18:07:11",{"$f":"C144+H144/3600/24","v":"2022-04-23T18:27:11"},"WOL#13",null,{"$f":"(C145-D143)*24*3600","v":1800.0000002095476},1200,null,null,null,0,"2022-04-23T18:01:54",{"$f":"\"0000    WAIT_SEC  \"&TEXT(G144,\"#0\")","v":"0000    WAIT_SEC  1800"},null,null,1.3888888890505768E-2,2.0833333335758653E-2,1.0069444448163267E-2]
[null,null,{"$f":"D144+10/60/24","v":"2022-04-23T18:37:11"},{"$f":"C145+H145/3600/24","v":"2022-04-23T18:41:41"},null,"SI HV ON","HEP_HV_ON",{"$f":"VLOOKUP(G145,List!B:C,2,0)","v":270},null,null,{"$f":"VLOOKUP(G145,List!B:E,4,0)","v":"dcsm-EF_HEPE_HV_ON_OBS_START"},{"$f":"VLOOKUP(G145,List!B:G,6,0)","v":6},"2022-04-23T18:31:54",{"$f":"+\"0000    CALL \"&K145&\" -Run\"","v":"0000    CALL dcsm-EF_HEPE_HV_ON_OBS_START -Run"},null,null,3.125000002910383E-3,3.125000002910383E-3,3.9814814808778465E-3]
[null,null,{"$f":"D145","v":"2022-04-23T18:41:41"},"2022-04-23T18:47:25",null,null,"ENA_HV_ON_CNT",{"$f":"VLOOKUP(G146,List!B:C,2,0)","v":344},null,null,{"$f":"VLOOKUP(G146,List!B:E,4,0)","v":"dcsm-EF_ENA_HV_ON_CNT"},{"$f":"VLOOKUP(G146,List!B:G,6,0)","v":18},"2022-04-23T18:36:24",{"$f":"+\"0000    CALL \"&K146&\" -Run\"","v":"0000    CALL dcsm-EF_ENA_HV_ON_CNT -Run"},null,null,3.9814814808778465E-3,3.9814814808778465E-3,1.9699074073287193E-2]
[null,null,"2022-04-23T18:47:25","2022-04-23T19:15:47",null,null,"MEA1_HV_ON",{"$f":"VLOOKUP(G147,List!B:C,2,0)","v":1702},null,null,{"$f":"VLOOKUP(G147,List!B:E,4,0)","v":"dcsm-EF_MEA1_HV_ON"},{"$f":"VLOOKUP(G147,List!B:G,6,0)","v":27},"2022-04-23T18:42:08","0000    CALL dcsm-EF_MEA1_HV_ON -Run",null,null,1.9699074073287193E-2,1.9699074073287193E-2,4.8611110833007842E-4]
[null,null,"2022-04-23T19:15:47","2022-04-23T19:16:29",null,"TLM mode change (MODE_5)","TLM_MODE_5",{"$f":"VLOOKUP(G148,List!B:C,2,0)","v":42},null,null,{"$f":"VLOOKUP(G148,List!B:E,4,0)","v":"dcsm-EF_BUS_TLM_MODE_5"},{"$f":"VLOOKUP(G148,List!B:G,6,0)","v":2},"2022-04-23T19:10:30","0000    CALL dcsm-EF_BUS_TLM_MODE_5 -Run",null,null,4.8611110833007842E-4,4.8611110833007842E-4,0.91599537037836853]
[null,null,"2022-04-23T19:16:29",{"$f":"C150","v":"2022-04-24T17:15:31"},"Observation N",null,null,{"$f":"(D149-C149)*3600*24","v":79142.000000691041},{"$f":"H149/3600","v":21.983888889080845},null,null,0,"2022-04-23T19:11:12",{"$f":"\"0000    WAIT_SEC  \"&TEXT(H149,\"#0\")","v":"0000    WAIT_SEC  79142"},null,null,0.91599537037836853,0.91599537037836853,4.8611110833007842E-4]
[null,null,{"$f":"D150-H150/3600/24","v":"2022-04-24T17:15:31"},{"$f":"C151","v":"2022-04-24T17:16:13"},null,"TLM mode change (MODE_10)","TLM_MODE_10",{"$f":"VLOOKUP(G150,List!B:C,2,0)","v":42},null,null,{"$f":"VLOOKUP(G150,List!B:E,4,0)","v":"dcsm-EF_BUS_TLM_MODE_10"},{"$f":"VLOOKUP(G150,List!B:G,6,0)","v":2},"2022-04-24T17:10:14",{"$f":"+\"0000    CALL \"&K150&\" -Run\"","v":"0000    CALL dcsm-EF_BUS_TLM_MODE_10 -Run"},null,null,4.8611110833007842E-4,4.8611110833007842E-4,2.1990740715409629E-3]
[null,null,{"$f":"D151-H151/3600/24","v":"2022-04-24T17:16:13"},{"$f":"C152","v":"2022-04-24T17:19:23"},null,"SI HV OFF","HEP_HV_OFF",{"$f":"VLOOKUP(G151,List!B:C,2,0)","v":190},null,null,{"$f":"VLOOKUP(G151,List!B:E,4,0)","v":"dcsm-EF_HEPE_HV_OFF_OBS_OFF"},{"$f":"VLOOKUP(G151,List!B:G,6,0)","v":5},"2022-04-24T17:10:56","0000    CALL dcsm-EF_HEPE_HV_OFF_OBS_OFF -Run",null,null,2.1990740715409629E-3,2.1990740715409629E-3,2.2916666639503092E-3]
[null,null,{"$f":"D152-H152/3600/24","v":"2022-04-24T17:19:23"},{"$f":"C153","v":"2022-04-24T17:22:41"},null,null,"ENA_HV_OFF",{"$f":"VLOOKUP(G152,List!B:C,2,0)","v":198},null,null,{"$f":"VLOOKUP(G152,List!B:E,4,0)","v":"dcsm-EF_ENA_HV_OFF"},{"$f":"VLOOKUP(G152,List!B:G,6,0)","v":4},"2022-04-24T17:14:06","0000    CALL dcsm-EF_ENA_HV_OFF -Run",null,null,2.2916666639503092E-3,2.2916666639503092E-3,2.1064814791316167E-3]
[null,null,{"$f":"D153-H153/3600/24","v":"2022-04-24T17:22:41"},{"$f":"C154","v":"2022-04-24T17:25:43"},null,null,"MEA1_HV_OFF",{"$f":"VLOOKUP(G153,List!B:C,2,0)","v":182},null,null,{"$f":"VLOOKUP(G153,List!B:E,4,0)","v":"dcsm-EF_MEA1_HV_OFF"},{"$f":"VLOOKUP(G153,List!B:G,6,0)","v":10},"2022-04-24T17:17:24","0000    CALL dcsm-EF_MEA1_HV_OFF -Run",null,null,2.1064814791316167E-3,2.1064814791316167E-3,1.3888888890505768E-2]
[null,null,"2022-04-24T17:25:43",{"$f":"C154+H154/3600/24","v":"2022-04-24T17:45:43"},"WOL#14",null,{"$f":"(C155-D153)*24*3600","v":1800.0000002095476},1200,null,null,null,0,"2022-04-24T17:20:26",{"$f":"\"0000    WAIT_SEC  \"&TEXT(G154,\"#0\")","v":"0000    WAIT_SEC  1800"},null,null,1.3888888890505768E-2,2.0833333335758653E-2,1.0069444448163267E-2]
[null,null,{"$f":"D154+10/60/24","v":"2022-04-24T17:55:43"},{"$f":"C155+H155/3600/24","v":"2022-04-24T18:00:13"},null,"SI HV ON","HEP_HV_ON",{"$f":"VLOOKUP(G155,List!B:C,2,0)","v":270},null,null,{"$f":"VLOOKUP(G155,List!B:E,4,0)","v":"dcsm-EF_HEPE_HV_ON_OBS_START"},{"$f":"VLOOKUP(G155,List!B:G,6,0)","v":6},"2022-04-24T17:50:26",{"$f":"+\"0000    CALL \"&K155&\" -Run\"","v":"0000    CALL dcsm-EF_HEPE_HV_ON_OBS_START -Run"},null,null,3.125000002910383E-3,3.125000002910383E-3,3.9814814808778465E-3]
[null,null,{"$f":"D155","v":"2022-04-24T18:00:13"},"2022-04-24T18:05:57",null,null,"ENA_HV_ON_CNT",{"$f":"VLOOKUP(G156,List!B:C,2,0)","v":344},null,null,{"$f":"VLOOKUP(G156,List!B:E,4,0)","v":"dcsm-EF_ENA_HV_ON_CNT"},{"$f":"VLOOKUP(G156,List!B:G,6,0)","v":18},"2022-04-24T17:54:56",{"$f":"+\"0000    CALL \"&K156&\" -Run\"","v":"0000    CALL dcsm-EF_ENA_HV_ON_CNT -Run"},null,null,3.9814814808778465E-3,3.9814814808778465E-3,1.9699074073287193E-2]
[null,null,"2022-04-24T18:05:57","2022-04-24T18:34:19",null,null,"MEA1_HV_ON",{"$f":"VLOOKUP(G157,List!B:C,2,0)","v":1702},null,null,{"$f":"VLOOKUP(G157,List!B:E,4,0)","v":"dcsm-EF_MEA1_HV_ON"},{"$f":"VLOOKUP(G157,List!B:G,6,0)","v":27},"2022-04-24T18:00:40","0000    CALL dcsm-EF_MEA1_HV_ON -Run",null,null,1.9699074073287193E-2,1.9699074073287193E-2,4.8611110833007842E-4]
[null,null,"2022-04-24T18:34:19","2022-04-24T18:35:01",null,"TLM mode change (MODE_5)","TLM_MODE_5",{"$f":"VLOOKUP(G158,List!B:C,2,0)","v":42},null,null,{"$f":"VLOOKUP(G158,List!B:E,4,0)","v":"dcsm-EF_BUS_TLM_MODE_5"},{"$f":"VLOOKUP(G158,List!B:G,6,0)","v":2},"2022-04-24T18:29:02","0000    CALL dcsm-EF_BUS_TLM_MODE_5 -Run",null,null,4.8611110833007842E-4,4.8611110833007842E-4,0.98291666667500976]
[null,null,"2022-04-24T18:35:01",{"$f":"C160","v":"2022-04-25T18:10:25"},"Observation O",null,null,{"$f":"(D159-C159)*3600*24","v":84924.000000720844},{"$f":"H159/3600","v":23.590000000200234},null,null,0,"2022-04-24T18:29:44",{"$f":"\"0000    WAIT_SEC  \"&TEXT(H159,\"#0\")","v":"0000    WAIT_SEC  84924"},null,null,0.98291666667500976,0.98291666667500976,4.8611110833007842E-4]
[null,null,{"$f":"D160-H160/3600/24","v":"2022-04-25T18:10:25"},{"$f":"C161","v":"2022-04-25T18:11:07"},null,"TLM mode change (MODE_10)","TLM_MODE_10",{"$f":"VLOOKUP(G160,List!B:C,2,0)","v":42},null,null,{"$f":"VLOOKUP(G160,List!B:E,4,0)","v":"dcsm-EF_BUS_TLM_MODE_10"},{"$f":"VLOOKUP(G160,List!B:G,6,0)","v":2},"2022-04-25T18:05:08",{"$f":"+\"0000    CALL \"&K160&\" -Run\"","v":"0000    CALL dcsm-EF_BUS_TLM_MODE_10 -Run"},null,null,4.8611110833007842E-4,4.8611110833007842E-4,2.1990740715409629E-3]
[null,null,{"$f":"D161-H161/3600/24","v":"2022-04-25T18:11:07"},{"$f":"C162","v":"2022-04-25T18:14:17"},null,"SI HV OFF","HEP_HV_OFF",{"$f":"VLOOKUP(G161,List!B:C,2,0)","v":190},null,null,{"$f":"VLOOKUP(G161,List!B:E,4,0)","v":"dcsm-EF_HEPE_HV_OFF_OBS_OFF"},{"$f":"VLOOKUP(G161,List!B:G,6,0)","v":5},"2022-04-25T18:05:50","0000    CALL dcsm-EF_HEPE_HV_OFF_OBS_OFF -Run",null,null,2.1990740715409629E-3,2.1990740715409629E-3,2.2916666639503092E-3]
[null,null,{"$f":"D162-H162/3600/24","v":"2022-04-25T18:14:17"},{"$f":"C163","v":"2022-04-25T18:17:35"},null,null,"ENA_HV_OFF",{"$f":"VLOOKUP(G162,List!B:C,2,0)","v":198},null,null,{"$f":"VLOOKUP(G162,List!B:E,4,0)","v":"dcsm-EF_ENA_HV_OFF"},{"$f":"VLOOKUP(G162,List!B:G,6,0)","v":4},"2022-04-25T18:09:00","0000    CALL dcsm-EF_ENA_HV_OFF -Run",null,null,2.2916666639503092E-3,2.2916666639503092E-3,2.1064814791316167E-3]
[null,null,{"$f":"D163-H163/3600/24","v":"2022-04-25T18:17:35"},{"$f":"C164","v":"2022-04-25T18:20:37"},null,null,"MEA1_HV_OFF",{"$f":"VLOOKUP(G163,List!B:C,2,0)","v":182},null,null,{"$f":"VLOOKUP(G163,List!B:E,4,0)","v":"dcsm-EF_MEA1_HV_OFF"},{"$f":"VLOOKUP(G163,List!B:G,6,0)","v":10},"2022-04-25T18:12:18","0000    CALL dcsm-EF_MEA1_HV_OFF -Run",null,null,2.1064814791316167E-3,2.1064814791316167E-3,1.3888888890505768E-2]
[null,null,"2022-04-25T18:20:37",{"$f":"C164+H164/3600/24","v":"2022-04-25T18:40:37"},"WOL#15",null,{"$f":"(C165-D163)*24*3600","v":1800.0000002095476},1200,null,null,null,0,"2022-04-25T18:15:20",{"$f":"\"0000    WAIT_SEC  \"&TEXT(G164,\"#0\")","v":"0000    WAIT_SEC  1800"},null,null,1.3888888890505768E-2,2.0833333335758653E-2,1.0069444448163267E-2]
[null,null,{"$f":"D164+10/60/24","v":"2022-04-25T18:50:37"},{"$f":"C165+H165/3600/24","v":"2022-04-25T18:55:07"},null,"SI HV ON","HEP_HV_ON",{"$f":"VLOOKUP(G165,List!B:C,2,0)","v":270},null,null,{"$f":"VLOOKUP(G165,List!B:E,4,0)","v":"dcsm-EF_HEPE_HV_ON_OBS_START"},{"$f":"VLOOKUP(G165,List!B:G,6,0)","v":6},"2022-04-25T18:45:20",{"$f":"+\"0000    CALL \"&K165&\" -Run\"","v":"0000    CALL dcsm-EF_HEPE_HV_ON_OBS_START -Run"},null,null,3.125000002910383E-3,3.125000002910383E-3,3.9814814808778465E-3]
[null,null,{"$f":"D165","v":"2022-04-25T18:55:07"},"2022-04-25T19:00:51",null,null,"ENA_HV_ON_CNT",{"$f":"VLOOKUP(G166,List!B:C,2,0)","v":344},null,null,{"$f":"VLOOKUP(G166,List!B:E,4,0)","v":"dcsm-EF_ENA_HV_ON_CNT"},{"$f":"VLOOKUP(G166,List!B:G,6,0)","v":18},"2022-04-25T18:49:50",{"$f":"+\"0000    CALL \"&K166&\" -Run\"","v":"0000    CALL dcsm-EF_ENA_HV_ON_CNT -Run"},null,null,3.9814814808778465E-3,3.9814814808778465E-3,1.9699074073287193E-2]
[null,null,"2022-04-25T19:00:51","2022-04-25T19:29:13",null,null,"MEA1_HV_ON",{"$f":"VLOOKUP(G167,List!B:C,2,0)","v":1702},null,null,{"$f":"VLOOKUP(G167,List!B:E,4,0)","v":"dcsm-EF_MEA1_HV_ON"},{"$f":"VLOOKUP(G167,List!B:G,6,0)","v":27},"2022-04-25T18:55:34","0000    CALL dcsm-EF_MEA1_HV_ON -Run",null,null,1.9699074073287193E-2,1.9699074073287193E-2,4.8611110833007842E-4]
[null,null,"2022-04-25T19:29:13","2022-04-25T19:29:55",null,"TLM mode change (MODE_5)","TLM_MODE_5",{"$f":"VLOOKUP(G168,List!B:C,2,0)","v":42},null,null,{"$f":"VLOOKUP(G168,List!B:E,4,0)","v":"dcsm-EF_BUS_TLM_MODE_5"},{"$f":"VLOOKUP(G168,List!B:G,6,0)","v":2},"2022-04-25T19:23:56","0000    CALL dcsm-EF_BUS_TLM_MODE_5 -Run",null,null,4.8611110833007842E-4,4.8611110833007842E-4,1.0397685185307637]
[null,null,"2022-04-25T19:29:55",{"$f":"C170","v":"2022-04-26T20:27:11"},"Observation P",null,null,{"$f":"(D169-C169)*3600*24","v":89836.000001057982},{"$f":"H169/3600","v":24.954444444738328},null,null,0,"2022-04-25T19:24:38",{"$f":"\"0000    WAIT_SEC  \"&TEXT(H169,\"#0\")","v":"0000    WAIT_SEC  89836"},null,null,1.0397685185307637,1.0397685185307637,4.8611110833007842E-4]
[null,null,{"$f":"D170-H170/3600/24","v":"2022-04-26T20:27:11"},{"$f":"C171","v":"2022-04-26T20:27:53"},null,"TLM mode change (MODE_10)","TLM_MODE_10",{"$f":"VLOOKUP(G170,List!B:C,2,0)","v":42},null,null,{"$f":"VLOOKUP(G170,List!B:E,4,0)","v":"dcsm-EF_BUS_TLM_MODE_10"},{"$f":"VLOOKUP(G170,List!B:G,6,0)","v":2},"2022-04-26T20:21:54",{"$f":"+\"0000    CALL \"&K170&\" -Run\"","v":"0000    CALL dcsm-EF_BUS_TLM_MODE_10 -Run"},null,null,4.8611110833007842E-4,4.8611110833007842E-4,2.1990740715409629E-3]
[null,null,{"$f":"D171-H171/3600/24","v":"2022-04-26T20:27:53"},{"$f":"C172","v":"2022-04-26T20:31:03"},null,"SI HV OFF","HEP_HV_OFF",{"$f":"VLOOKUP(G171,List!B:C,2,0)","v":190},null,null,{"$f":"VLOOKUP(G171,List!B:E,4,0)","v":"dcsm-EF_HEPE_HV_OFF_OBS_OFF"},{"$f":"VLOOKUP(G171,List!B:G,6,0)","v":5},"2022-04-26T20:22:36","0000    CALL dcsm-EF_HEPE_HV_OFF_OBS_OFF -Run",null,null,2.1990740715409629E-3,2.1990740715409629E-3,2.2916666639503092E-3]
[null,null,{"$f":"D172-H172/3600/24","v":"2022-04-26T20:31:03"},{"$f":"C173","v":"2022-04-26T20:34:21"},null,null,"ENA_HV_OFF",{"$f":"VLOOKUP(G172,List!B:C,2,0)","v":198},null,null,{"$f":"VLOOKUP(G172,List!B:E,4,0)","v":"dcsm-EF_ENA_HV_OFF"},{"$f":"VLOOKUP(G172,List!B:G,6,0)","v":4},"2022-04-26T20:25:46","0000    CALL dcsm-EF_ENA_HV_OFF -Run",null,null,2.2916666639503092E-3,2.2916666639503092E-3,2.1064814791316167E-3]
[null,null,{"$f":"D173-H173/3600/24","v":"2022-04-26T20:34:21"},{"$f":"C174","v":"2022-04-26T20:37:23"},null,null,"MEA1_HV_OFF",{"$f":"VLOOKUP(G173,List!B:C,2,0)","v":182},null,null,{"$f":"VLOOKUP(G173,List!B:E,4,0)","v":"dcsm-EF_MEA1_HV_OFF"},{"$f":"VLOOKUP(G173,List!B:G,6,0)","v":10},"2022-04-26T20:29:04","0000    CALL dcsm-EF_MEA1_HV_OFF -Run",null,null,2.1064814791316167E-3,2.1064814791316167E-3,1.3888888890505768E-2]
[null,null,"2022-04-26T20:37:23",{"$f":"C174+H174/3600/24","v":"2022-04-26T20:57:23"},"WOL#16",null,{"$f":"(C175-D173)*24*3600","v":1800.0000002095476},1200,null,null,null,0,"2022-04-26T20:32:06",{"$f":"\"0000    WAIT_SEC  \"&TEXT(G174,\"#0\")","v":"0000    WAIT_SEC  1800"},null,null,1.3888888890505768E-2,2.0833333335758653E-2,1.0069444448163267E-2]
[null,null,{"$f":"D174+10/60/24","v":"2022-04-26T21:07:23"},{"$f":"C175+H175/3600/24","v":"2022-04-26T21:11:53"},null,"SI HV ON","HEP_HV_ON",{"$f":"VLOOKUP(G175,List!B:C,2,0)","v":270},null,null,{"$f":"VLOOKUP(G175,List!B:E,4,0)","v":"dcsm-EF_HEPE_HV_ON_OBS_START"},{"$f":"VLOOKUP(G175,List!B:G,6,0)","v":6},"2022-04-26T21:02:06",{"$f":"+\"0000    CALL \"&K175&\" -Run\"","v":"0000    CALL dcsm-EF_HEPE_HV_ON_OBS_START -Run"},null,null,3.125000002910383E-3,3.125000002910383E-3,3.9814814808778465E-3]
[null,null,{"$f":"D175","v":"2022-04-26T21:11:53"},"2022-04-26T21:17:37",null,null,"ENA_HV_ON_CNT",{"$f":"VLOOKUP(G176,List!B:C,2,0)","v":344},null,null,{"$f":"VLOOKUP(G176,List!B:E,4,0)","v":"dcsm-EF_ENA_HV_ON_CNT"},{"$f":"VLOOKUP(G176,List!B:G,6,0)","v":18},"2022-04-26T21:06:36",{"$f":"+\"0000    CALL \"&K176&\" -Run\"","v":"0000    CALL dcsm-EF_ENA_HV_ON_CNT -Run"},null,null,3.9814814808778465E-3,3.9814814808778465E-3,1.9699074073287193E-2]
[null,null,"2022-04-26T21:17:37","2022-04-26T21:45:59",null,null,"MEA1_HV_ON",{"$f":"VLOOKUP(G177,List!B:C,2,0)","v":1702},null,null,{"$f":"VLOOKUP(G177,List!B:E,4,0)","v":"dcsm-EF_MEA1_HV_ON"},{"$f":"VLOOKUP(G177,List!B:G,6,0)","v":27},"2022-04-26T21:12:20","0000    CALL dcsm-EF_MEA1_HV_ON -Run",null,null,1.9699074073287193E-2,1.9699074073287193E-2,4.8611110833007842E-4]
[null,null,"2022-04-26T21:45:59","2022-04-26T21:46:41",null,"TLM mode change (MODE_5)","TLM_MODE_5",{"$f":"VLOOKUP(G178,List!B:C,2,0)","v":42},null,null,{"$f":"VLOOKUP(G178,List!B:E,4,0)","v":"dcsm-EF_BUS_TLM_MODE_5"},{"$f":"VLOOKUP(G178,List!B:G,6,0)","v":2},"2022-04-26T21:40:42","0000    CALL dcsm-EF_BUS_TLM_MODE_5 -Run",null,null,4.8611110833007842E-4,4.8611110833007842E-4,1.0242708333389601]
[null,null,"2022-04-26T21:46:41",{"$f":"C180","v":"2022-04-27T22:21:38"},"Observation Q",null,null,{"$f":"(D179-C179)*3600*24","v":88497.00000048615},{"$f":"H179/3600","v":24.582500000135042},null,null,0,"2022-04-26T21:41:24",{"$f":"\"0000    WAIT_SEC  \"&TEXT(H179,\"#0\")","v":"0000    WAIT_SEC  88497"},null,null,1.0242708333389601,1.0242708333389601,4.8611110833007842E-4]
[null,null,{"$f":"D180-H180/3600/24","v":"2022-04-27T22:21:38"},{"$f":"C181","v":"2022-04-27T22:22:20"},null,"TLM mode change (MODE_10)","TLM_MODE_10",{"$f":"VLOOKUP(G180,List!B:C,2,0)","v":42},null,null,{"$f":"VLOOKUP(G180,List!B:E,4,0)","v":"dcsm-EF_BUS_TLM_MODE_10"},{"$f":"VLOOKUP(G180,List!B:G,6,0)","v":2},"2022-04-27T22:16:21",{"$f":"+\"0000    CALL \"&K180&\" -Run\"","v":"0000    CALL dcsm-EF_BUS_TLM_MODE_10 -Run"},null,null,4.8611110833007842E-4,4.8611110833007842E-4,2.1990740715409629E-3]
[null,null,{"$f":"D181-H181/3600/24","v":"2022-04-27T22:22:20"},{"$f":"C182","v":"2022-04-27T22:25:30"},null,"SI HV OFF","HEP_HV_OFF",{"$f":"VLOOKUP(G181,List!B:C,2,0)","v":190},null,null,{"$f":"VLOOKUP(G181,List!B:E,4,0)","v":"dcsm-EF_HEPE_HV_OFF_OBS_OFF"},{"$f":"VLOOKUP(G181,List!B:G,6,0)","v":5},"2022-04-27T22:17:03","0000    CALL dcsm-EF_HEPE_HV_OFF_OBS_OFF -Run",null,null,2.1990740715409629E-3,2.1990740715409629E-3,2.2916666639503092E-3]
[null,null,{"$f":"D182-H182/3600/24","v":"2022-04-27T22:25:30"},{"$f":"C183","v":"2022-04-27T22:28:48"},null,null,"ENA_HV_OFF",{"$f":"VLOOKUP(G182,List!B:C,2,0)","v":198},null,null,{"$f":"VLOOKUP(G182,List!B:E,4,0)","v":"dcsm-EF_ENA_HV_OFF"},{"$f":"VLOOKUP(G182,List!B:G,6,0)","v":4},"2022-04-27T22:20:13","0000    CALL dcsm-EF_ENA_HV_OFF -Run",null,null,2.2916666639503092E-3,2.2916666639503092E-3,2.1527777789742686E-3]
[null,null,{"$f":"D183-H183/3600/24","v":"2022-04-27T22:28:48"},{"$f":"C184","v":"2022-04-27T22:31:54"},null,null,"MEA1_HV_SCAN_OFF",{"$f":"VLOOKUP(G183,List!B:C,2,0)","v":186},null,null,{"$f":"VLOOKUP(G183,List!B:E,4,0)","v":"dcsm-EF_MEA1_HV_SCAN_OFF"},{"$f":"VLOOKUP(G183,List!B:G,6,0)","v":12},"2022-04-27T22:23:31","0000    CALL dcsm-EF_MEA1_HV_SCAN_OFF -Run",null,null,2.1527777789742686E-3,2.1527777789742686E-3,8.1018518540076911E-4]
[null,null,{"$f":"D184-H184/3600/24","v":"2022-04-27T22:31:54"},{"$f":"C185","v":"2022-04-27T22:33:04"},null,"SI OFF","HEP_OFF",{"$f":"VLOOKUP(G184,List!B:C,2,0)","v":70},null,null,{"$f":"VLOOKUP(G184,List!B:E,4,0)","v":"dcsm-EF_HEPE_OFF_STOP"},{"$f":"VLOOKUP(G184,List!B:G,6,0)","v":4},"2022-04-27T22:26:37",{"$f":"+\"0000    CALL \"&K184&\" -Run\"","v":"0000    CALL dcsm-EF_HEPE_OFF_STOP -Run"},null,null,8.1018518540076911E-4,8.1018518540076911E-4,1.8518518554628827E-3]
[null,null,"2022-04-27T22:33:04","2022-04-27T22:35:44",null,null,"MEA1_OFF",{"$f":"VLOOKUP(G185,List!B:C,2,0)","v":160},null,null,{"$f":"VLOOKUP(G185,List!B:E,4,0)","v":"dcsm-EF_MEA1_OFF"},{"$f":"VLOOKUP(G185,List!B:G,6,0)","v":4},"2022-04-27T22:27:47",{"$f":"+\"0000    CALL \"&K185&\" -Run\"","v":"0000    CALL dcsm-EF_MEA1_OFF -Run"},null,null,1.8518518554628827E-3,1.8518518554628827E-3,9.2592592409346253E-5]
[null,null,"2022-04-27T22:35:44","2022-04-27T22:35:52",null,null,"MGF_OFF",{"$f":"VLOOKUP(G186,List!B:C,2,0)","v":8},null,null,{"$f":"VLOOKUP(G186,List!B:E,4,0)","v":"dcsm-EF_MGF_OFF"},{"$f":"VLOOKUP(G186,List!B:G,6,0)","v":1},"2022-04-27T22:30:27","0000    CALL dcsm-EF_MGF_OFF -Run",null,null,9.2592592409346253E-5,9.2592592409346253E-5,4.6296296204673126E-4]
[null,null,"2022-04-27T22:35:52","2022-04-27T22:36:32",null,null,"PME_OFF",{"$f":"VLOOKUP(G187,List!B:C,2,0)","v":40},null,null,{"$f":"VLOOKUP(G187,List!B:E,4,0)","v":"dcsm-EF_PME_OFF"},{"$f":"VLOOKUP(G187,List!B:G,6,0)","v":1},"2022-04-27T22:30:35","0000    CALL dcsm-EF_PME_OFF -Run",null,null,4.6296296204673126E-4,4.6296296204673126E-4,1.0185185165028088E-3]
[null,null,"2022-04-27T22:36:32","2022-04-27T22:38:00",null,null,"ENA_OFF",{"$f":"VLOOKUP(G188,List!B:C,2,0)","v":88},null,null,{"$f":"VLOOKUP(G188,List!B:E,4,0)","v":"dcsm-EF_ENA_power_OFF"},{"$f":"VLOOKUP(G188,List!B:G,6,0)","v":4},"2022-04-27T22:31:15","0000    CALL dcsm-EF_ENA_power_OFF -Run",null,null,1.0185185165028088E-3,1.0185185165028088E-3,1.3888888861401938E-3]
[null,null,"2022-04-27T22:38:00","2022-04-27T22:40:00",null,"MDP OFF","MDP_OFF_D",{"$f":"VLOOKUP(G189,List!B:C,2,0)","v":120},null,null,{"$f":"VLOOKUP(G189,List!B:E,4,0)","v":"dcsm-EF_MDP_POWEROFF"},{"$f":"VLOOKUP(G189,List!B:G,6,0)","v":3},"2022-04-27T22:32:43","0000    CALL dcsm-EF_MDP_POWEROFF -Run",null,null,1.3888888861401938E-3,{"$f":"+C191-C189","v":5.694444444088731E-2},{"$f":"+D191-D189","v":6.1446759260434192E-2}]
[null,null,{"$f":"D189","v":"2022-04-27T22:40:00"},{"$f":"C191","v":"2022-04-28"},"WOL　WAIT TIM",null,{"$f":"(C191-D189)*24*3600","v":4799.9999999301508},1200,null,null,null,0,{"$f":"C190-317/3600/24","v":"2022-04-27T22:34:43"},{"$f":"\"0000    WAIT_SEC  \"&TEXT(G190,\"#0\")","v":"0000    WAIT_SEC  4800"},null,null,{"$f":"+D190-C190","v":5.5555555554747116E-2},{"$f":"+C191-C190","v":5.5555555554747116E-2},{"$f":"+D191-D190","v":5.8912037056870759E-3}]
[null,null,"2022-04-28",{"$f":"C191+H191/3600/24","v":"2022-04-28T00:08:29"},null,"MDP ON","MDP_ON_D",{"$f":"VLOOKUP(G191,List!B:C,2,0)","v":509},null,null,{"$f":"VLOOKUP(G191,List!B:E,4,0)","v":"dcsm-EF_MDP_ON"},{"$f":"VLOOKUP(G191,List!B:G,6,0)","v":11},"2022-04-27T23:54:43","0000    CALL dcsm-EF_MDP_ON -Run",null,null,{"$f":"+D191-C191","v":5.8912037056870759E-3},{"$f":"+C192-C191","v":5.8912037056870759E-3},{"$f":"+D192-D191","v":4.8611110833007842E-4}]
[null,null,{"$f":"D191","v":"2022-04-28T00:08:29"},{"$f":"C192+H192/3600/24","v":"2022-04-28T00:09:11"},null,null,"MDP_CRUISE_SET",{"$f":"VLOOKUP(G192,List!B:C,2,0)","v":42},null,null,{"$f":"VLOOKUP(G192,List!B:E,4,0)","v":"dcsm-EF_MDP_CRUISE_SET"},{"$f":"VLOOKUP(G192,List!B:G,6,0)","v":2},"2022-04-28T00:03:12","0000    CALL dcsm-EF_MDP_CRUISE_SET -Run",null,null,{"$f":"+D192-C192","v":4.8611110833007842E-4},{"$f":"+C193-C192","v":4.8611110833007842E-4},4.8611110833007842E-4]
[null,null,{"$f":"D192","v":"2022-04-28T00:09:11"},{"$f":"C193+H193/3600/24","v":"2022-04-28T00:09:53"},null,"TLM mode change (MODE_10)","TLM_MODE_10",{"$f":"VLOOKUP(G193,List!B:C,2,0)","v":42},null,null,{"$f":"VLOOKUP(G193,List!B:E,4,0)","v":"dcsm-EF_BUS_TLM_MODE_10"},{"$f":"VLOOKUP(G193,List!B:G,6,0)","v":2},"2022-04-28T00:03:54","0000    CALL dcsm-EF_BUS_TLM_MODE_10 -Run",null,null,{"$f":"+D193-C193","v":4.8611110833007842E-4},{"$f":"+C194-C193","v":4.8611110833007842E-4},1.2638888889341615E-2]
[null,null,"2022-04-28T00:09:53","2022-04-28T00:28:05",null,"SI ON","MSA_ON_SETUP_C",{"$f":"VLOOKUP(G194,List!B:C,2,0)","v":1092},null,null,{"$f":"VLOOKUP(G194,List!B:E,4,0)","v":"dcsm-EF_MSA_ON_C"},{"$f":"VLOOKUP(G194,List!B:G,6,0)","v":15},"2022-04-28T00:04:36","0000    CALL dcsm-EF_MSA_ON_C -Run",null,null,1.2638888889341615E-2,1.2638888889341615E-2,{"$f":"+D195-D194","v":9.2592592409346253E-4}]
[null,null,"2022-04-28T00:28:05","2022-04-28T00:29:25",null,null,"PME_ON",{"$f":"VLOOKUP(G195,List!B:C,2,0)","v":80},null,null,{"$f":"VLOOKUP(G195,List!B:E,4,0)","v":"dcsm-EF_PME_ON"},{"$f":"VLOOKUP(G195,List!B:G,6,0)","v":2},"2022-04-28T00:22:48","0000    CALL dcsm-EF_PME_ON -Run",null,null,9.2592592409346253E-4,9.2592592409346253E-4,1.6203703853534535E-4]
[null,null,"2022-04-28T00:29:25","2022-04-28T00:29:39",null,null,"MGF_ON_SETUP",{"$f":"VLOOKUP(G196,List!B:C,2,0)","v":14},null,null,{"$f":"VLOOKUP(G196,List!B:E,4,0)","v":"dcsm-EF_MGF_ON"},{"$f":"VLOOKUP(G196,List!B:G,6,0)","v":3},"2022-04-28T00:24:08","0000    CALL dcsm-EF_MGF_ON -Run",null,null,1.6203703853534535E-4,1.6203703853534535E-4,3.379629626579117E-3]
[null,null,"2022-04-28T00:29:39","2022-04-28T00:34:31",null,null,"MEA1_ON_SETUP_SW",{"$f":"VLOOKUP(G197,List!B:C,2,0)","v":292},null,null,{"$f":"VLOOKUP(G197,List!B:E,4,0)","v":"dcsm-EF_MEA1_ON_SW"},{"$f":"VLOOKUP(G197,List!B:G,6,0)","v":12},"2022-04-28T00:24:22","0000    CALL dcsm-EF_MEA1_ON_SW -Run",null,null,3.379629626579117E-3,3.379629626579117E-3,6.5277777757728472E-3]
[null,null,"2022-04-28T00:34:31","2022-04-28T00:43:55",null,null,"ENA_ON_SETUP",{"$f":"VLOOKUP(G198,List!B:C,2,0)","v":564},null,null,{"$f":"VLOOKUP(G198,List!B:E,4,0)","v":"dcsm-EF_ENA_power_ON"},{"$f":"VLOOKUP(G198,List!B:G,6,0)","v":7},"2022-04-28T00:29:14","0000    CALL dcsm-EF_ENA_power_ON -Run",null,null,6.5277777757728472E-3,6.5277777757728472E-3,4.4212962966412306E-3]
[null,null,"2022-04-28T00:43:55","2022-04-28T00:50:17",null,null,"MIA_ON_SETUP",{"$f":"VLOOKUP(G199,List!B:C,2,0)","v":382},null,null,{"$f":"VLOOKUP(G199,List!B:E,4,0)","v":"dcsm-EF_MIA_ON"},{"$f":"VLOOKUP(G199,List!B:G,6,0)","v":6},{"$f":"C199-317/3600/24","v":"2022-04-28T00:38:38"},"0000    CALL dcsm-EF_MIA_ON -Run",null,null,4.4212962966412306E-3,4.4212962966412306E-3,1.4236111113859806E-2]
[null,null,"2022-04-28T00:50:17","2022-04-28T01:10:47",null,null,"HEP_ON_SETUP",{"$f":"VLOOKUP(G200,List!B:C,2,0)","v":1230},null,null,{"$f":"VLOOKUP(G200,List!B:E,4,0)","v":"dcsm-EF_HEP_ON_START_for_TL"},{"$f":"VLOOKUP(G200,List!B:G,6,0)","v":34},"2022-04-28T00:45:00","0000    CALL dcsm-EF_HEP_ON_START_for_TL -Run",null,null,1.4236111113859806E-2,1.4236111113859806E-2,3.125000002910383E-3]
[null,null,{"$f":"D200","v":"2022-04-28T01:10:47"},"2022-04-28T01:15:17",null,"SI HV ON","HEP_HV_ON",{"$f":"VLOOKUP(G201,List!B:C,2,0)","v":270},null,null,{"$f":"VLOOKUP(G201,List!B:E,4,0)","v":"dcsm-EF_HEPE_HV_ON_OBS_START"},{"$f":"VLOOKUP(G201,List!B:G,6,0)","v":6},"2022-04-28T01:05:30",{"$f":"+\"0000    CALL \"&K201&\" -Run\"","v":"0000    CALL dcsm-EF_HEPE_HV_ON_OBS_START -Run"},null,null,3.125000002910383E-3,3.125000002910383E-3,3.9814814808778465E-3]
[null,null,{"$f":"D201","v":"2022-04-28T01:15:17"},"2022-04-28T01:21:01",null,null,"ENA_HV_ON_CNT",{"$f":"VLOOKUP(G202,List!B:C,2,0)","v":344},null,null,{"$f":"VLOOKUP(G202,List!B:E,4,0)","v":"dcsm-EF_ENA_HV_ON_CNT"},{"$f":"VLOOKUP(G202,List!B:G,6,0)","v":18},"2022-04-28T01:10:00",{"$f":"+\"0000    CALL \"&K202&\" -Run\"","v":"0000    CALL dcsm-EF_ENA_HV_ON_CNT -Run"},null,null,3.9814814808778465E-3,3.9814814808778465E-3,3.0324074105010368E-3]
[null,null,"2022-04-28T01:21:01","2022-04-28T01:25:23",null,null,"MIA_HV_ON_SW_RC",{"$f":"VLOOKUP(G203,List!B:C,2,0)","v":262},null,null,{"$f":"VLOOKUP(G203,List!B:E,4,0)","v":"dcsm-EF_MIA_HV_ON_SW_RC"},{"$f":"VLOOKUP(G203,List!B:G,6,0)","v":7},"2022-04-28T01:15:44","0000    CALL dcsm-EF_MIA_HV_ON_SW_RC -Run",null,null,3.0324074105010368E-3,3.0324074105010368E-3,1.9699074073287193E-2]
[null,null,"2022-04-28T01:25:23","2022-04-28T01:53:45",null,null,"MEA1_HV_ON",{"$f":"VLOOKUP(G204,List!B:C,2,0)","v":1702},null,null,{"$f":"VLOOKUP(G204,List!B:E,4,0)","v":"dcsm-EF_MEA1_HV_ON"},{"$f":"VLOOKUP(G204,List!B:G,6,0)","v":27},"2022-04-28T01:20:06","0000    CALL dcsm-EF_MEA1_HV_ON -Run",null,null,1.9699074073287193E-2,1.9699074073287193E-2,1.8206018517958E-2]
[null,null,"2022-04-28T01:53:45","2022-04-28T02:19:58",null,null,"MSA_HV_ON_1_MFB_SF",{"$f":"VLOOKUP(G205,List!B:C,2,0)","v":1573},null,null,{"$f":"VLOOKUP(G205,List!B:E,4,0)","v":"dcsm-EF_MSA_HV_ON_1_MFB_Safe"},{"$f":"VLOOKUP(G205,List!B:G,6,0)","v":108},"2022-04-28T01:48:28","0000    CALL dcsm-EF_MSA_HV_ON_1_MFB_Safe -Run",null,null,1.8206018517958E-2,1.8206018517958E-2,2.1527777775190771E-2]
[null,null,"2022-04-28T02:19:58","2022-04-28T02:50:58",null,null,"MSA_HV_ON_2_MFB_SF",{"$f":"VLOOKUP(G206,List!B:C,2,0)","v":1860},null,null,{"$f":"VLOOKUP(G206,List!B:E,4,0)","v":"dcsm-EF_MSA_HV_ON_2_MFB_Safe"},{"$f":"VLOOKUP(G206,List!B:G,6,0)","v":124},"2022-04-28T02:14:41","0000    CALL dcsm-EF_MSA_HV_ON_2_MFB_Safe -Run",null,null,2.1527777775190771E-2,2.1527777775190771E-2,4.8611110833007842E-4]
[null,null,"2022-04-28T02:50:58","2022-04-28T02:51:40",null,"TLM mode change (MODE_5)","TLM_MODE_5",{"$f":"VLOOKUP(G207,List!B:C,2,0)","v":42},null,null,{"$f":"VLOOKUP(G207,List!B:E,4,0)","v":"dcsm-EF_BUS_TLM_MODE_5"},{"$f":"VLOOKUP(G207,List!B:G,6,0)","v":2},"2022-04-28T02:45:41","0000    CALL dcsm-EF_BUS_TLM_MODE_5 -Run",null,null,4.8611110833007842E-4,4.8611110833007842E-4,0.83606481483002426]
[null,null,"2022-04-28T02:51:40",{"$f":"C209","v":"2022-04-28T22:55:36"},"Observation R",null,null,{"$f":"(D208-C208)*3600*24","v":72236.000001314096},{"$f":"H208/3600","v":20.065555555920582},null,null,0,"2022-04-28T02:46:23",{"$f":"\"0000    WAIT_SEC  \"&TEXT(H208,\"#0\")","v":"0000    WAIT_SEC  72236"},null,null,0.83606481483002426,0.83606481483002426,4.8611110833007842E-4]
[null,null,{"$f":"D209-H209/3600/24","v":"2022-04-28T22:55:36"},{"$f":"C210","v":"2022-04-28T22:56:18"},null,"TLM mode change (MODE_10)","TLM_MODE_10",{"$f":"VLOOKUP(G209,List!B:C,2,0)","v":42},null,null,{"$f":"VLOOKUP(G209,List!B:E,4,0)","v":"dcsm-EF_BUS_TLM_MODE_10"},{"$f":"VLOOKUP(G209,List!B:G,6,0)","v":2},"2022-04-28T22:50:19",{"$f":"+\"0000    CALL \"&K209&\" -Run\"","v":"0000    CALL dcsm-EF_BUS_TLM_MODE_10 -Run"},null,null,4.8611110833007842E-4,4.8611110833007842E-4,2.1990740715409629E-3]
[null,null,{"$f":"D210-H210/3600/24","v":"2022-04-28T22:56:18"},{"$f":"C211","v":"2022-04-28T22:59:28"},null,"SI HV OFF","HEP_HV_OFF",{"$f":"VLOOKUP(G210,List!B:C,2,0)","v":190},null,null,{"$f":"VLOOKUP(G210,List!B:E,4,0)","v":"dcsm-EF_HEPE_HV_OFF_OBS_OFF"},{"$f":"VLOOKUP(G210,List!B:G,6,0)","v":5},"2022-04-28T22:51:01","0000    CALL dcsm-EF_HEPE_HV_OFF_OBS_OFF -Run",null,null,2.1990740715409629E-3,2.1990740715409629E-3,2.2916666639503092E-3]
[null,null,{"$f":"D211-H211/3600/24","v":"2022-04-28T22:59:28"},{"$f":"C212","v":"2022-04-28T23:02:46"},null,null,"ENA_HV_OFF",{"$f":"VLOOKUP(G211,List!B:C,2,0)","v":198},null,null,{"$f":"VLOOKUP(G211,List!B:E,4,0)","v":"dcsm-EF_ENA_HV_OFF"},{"$f":"VLOOKUP(G211,List!B:G,6,0)","v":4},"2022-04-28T22:54:11","0000    CALL dcsm-EF_ENA_HV_OFF -Run",null,null,2.2916666639503092E-3,2.2916666639503092E-3,6.944444467080757E-4]
[null,null,"2022-04-28T23:02:46","2022-04-28T23:03:46",null,null,"MIA_HV_OFF",{"$f":"VLOOKUP(G212,List!B:C,2,0)","v":60},null,null,{"$f":"VLOOKUP(G212,List!B:E,4,0)","v":"dcsm-EF_MIA_HV_OFF"},{"$f":"VLOOKUP(G212,List!B:G,6,0)","v":1},"2022-04-28T22:57:29","0000    CALL dcsm-EF_MIA_HV_OFF -Run",null,null,6.944444467080757E-4,6.944444467080757E-4,2.1064814791316167E-3]
[null,null,"2022-04-28T23:03:46","2022-04-28T23:06:48",null,null,"MEA1_HV_OFF",{"$f":"VLOOKUP(G213,List!B:C,2,0)","v":182},null,null,{"$f":"VLOOKUP(G213,List!B:E,4,0)","v":"dcsm-EF_MEA1_HV_OFF"},{"$f":"VLOOKUP(G213,List!B:G,6,0)","v":10},"2022-04-28T22:58:29","0000    CALL dcsm-EF_MEA1_HV_OFF -Run",null,null,2.1064814791316167E-3,2.1064814791316167E-3,8.9583333319751546E-3]
[null,null,"2022-04-28T23:06:48","2022-04-28T23:19:42",null,null,"MSA_HV_OFF_VFB",{"$f":"VLOOKUP(G214,List!B:C,2,0)","v":774},null,null,{"$f":"VLOOKUP(G214,List!B:E,4,0)","v":"dcsm-EF_MSA_HV_OFF_VFB"},{"$f":"VLOOKUP(G214,List!B:G,6,0)","v":25},"2022-04-28T23:01:31","0000    CALL dcsm-EF_MSA_HV_OFF_VFB -Run",null,null,8.9583333319751546E-3,8.9583333319751546E-3,1.3888888890505768E-2]
[null,null,"2022-04-28T23:19:42",{"$f":"C215+H215/3600/24","v":"2022-04-28T23:39:42"},"WOL#17",null,{"$f":"(C216-D214)*24*3600","v":1800.0000002095476},1200,null,null,null,0,"2022-04-28T23:14:25",{"$f":"\"0000    WAIT_SEC  \"&TEXT(G215,\"#0\")","v":"0000    WAIT_SEC  1800"},null,null,1.3888888890505768E-2,2.0833333335758653E-2,1.0069444448163267E-2]
[null,null,{"$f":"D215+10/60/24","v":"2022-04-28T23:49:42"},{"$f":"C216+H216/3600/24","v":"2022-04-28T23:54:12"},null,"SI HV ON","HEP_HV_ON",{"$f":"VLOOKUP(G216,List!B:C,2,0)","v":270},null,null,{"$f":"VLOOKUP(G216,List!B:E,4,0)","v":"dcsm-EF_HEPE_HV_ON_OBS_START"},{"$f":"VLOOKUP(G216,List!B:G,6,0)","v":6},"2022-04-28T23:44:25",{"$f":"+\"0000    CALL \"&K216&\" -Run\"","v":"0000    CALL dcsm-EF_HEPE_HV_ON_OBS_START -Run"},null,null,3.125000002910383E-3,3.125000002910383E-3,3.9814814808778465E-3]
[null,null,{"$f":"D216","v":"2022-04-28T23:54:12"},"2022-04-28T23:59:56",null,null,"ENA_HV_ON_CNT",{"$f":"VLOOKUP(G217,List!B:C,2,0)","v":344},null,null,{"$f":"VLOOKUP(G217,List!B:E,4,0)","v":"dcsm-EF_ENA_HV_ON_CNT"},{"$f":"VLOOKUP(G217,List!B:G,6,0)","v":18},"2022-04-28T23:48:55",{"$f":"+\"0000    CALL \"&K217&\" -Run\"","v":"0000    CALL dcsm-EF_ENA_HV_ON_CNT -Run"},null,null,3.9814814808778465E-3,3.9814814808778465E-3,3.0324074105010368E-3]
[null,null,"2022-04-28T23:59:56","2022-04-29T00:04:18",null,null,"MIA_HV_ON_SW_RC",{"$f":"VLOOKUP(G218,List!B:C,2,0)","v":262},null,null,{"$f":"VLOOKUP(G218,List!B:E,4,0)","v":"dcsm-EF_MIA_HV_ON_SW_RC"},{"$f":"VLOOKUP(G218,List!B:G,6,0)","v":7},"2022-04-28T23:54:39","0000    CALL dcsm-EF_MIA_HV_ON_SW_RC -Run",null,null,3.0324074105010368E-3,3.0324074105010368E-3,1.9699074073287193E-2]
[null,null,"2022-04-29T00:04:18","2022-04-29T00:32:40",null,null,"MEA1_HV_ON",{"$f":"VLOOKUP(G219,List!B:C,2,0)","v":1702},null,null,{"$f":"VLOOKUP(G219,List!B:E,4,0)","v":"dcsm-EF_MEA1_HV_ON"},{"$f":"VLOOKUP(G219,List!B:G,6,0)","v":27},"2022-04-28T23:59:01","0000    CALL dcsm-EF_MEA1_HV_ON -Run",null,null,1.9699074073287193E-2,1.9699074073287193E-2,1.8206018517958E-2]
[null,null,"2022-04-29T00:32:40","2022-04-29T00:58:53",null,null,"MSA_HV_ON_1_MFB_SF",{"$f":"VLOOKUP(G220,List!B:C,2,0)","v":1573},null,null,{"$f":"VLOOKUP(G220,List!B:E,4,0)","v":"dcsm-EF_MSA_HV_ON_1_MFB_Safe"},{"$f":"VLOOKUP(G220,List!B:G,6,0)","v":108},"2022-04-29T00:27:23","0000    CALL dcsm-EF_MSA_HV_ON_1_MFB_Safe -Run",null,null,1.8206018517958E-2,1.8206018517958E-2,2.1527777775190771E-2]
[null,null,"2022-04-29T00:58:53","2022-04-29T01:29:53",null,null,"MSA_HV_ON_2_MFB_SF",{"$f":"VLOOKUP(G221,List!B:C,2,0)","v":1860},null,null,{"$f":"VLOOKUP(G221,List!B:E,4,0)","v":"dcsm-EF_MSA_HV_ON_2_MFB_Safe"},{"$f":"VLOOKUP(G221,List!B:G,6,0)","v":124},"2022-04-29T00:53:36","0000    CALL dcsm-EF_MSA_HV_ON_2_MFB_Safe -Run",null,null,2.1527777775190771E-2,2.1527777775190771E-2,4.8611110833007842E-4]
[null,null,"2022-04-29T01:29:53","2022-04-29T01:30:35",null,"TLM mode change (MODE_5)","TLM_MODE_5",{"$f":"VLOOKUP(G222,List!B:C,2,0)","v":42},null,null,{"$f":"VLOOKUP(G222,List!B:E,4,0)","v":"dcsm-EF_BUS_TLM_MODE_5"},{"$f":"VLOOKUP(G222,List!B:G,6,0)","v":2},"2022-04-29T01:24:36","0000    CALL dcsm-EF_BUS_TLM_MODE_5 -Run",null,null,4.8611110833007842E-4,4.8611110833007842E-4,0.81751157408143627]
[null,null,"2022-04-29T01:30:35",{"$f":"C224","v":"2022-04-29T21:07:48"},"Observation S",null,null,{"$f":"(D223-C223)*3600*24","v":70633.000000636093},{"$f":"H223/3600","v":19.62027777795447},null,null,0,"2022-04-29T01:25:18",{"$f":"\"0000    WAIT_SEC  \"&TEXT(H223,\"#0\")","v":"0000    WAIT_SEC  70633"},null,null,0.81751157408143627,0.81751157408143627,4.8611110833007842E-4]
[null,null,{"$f":"D224-H224/3600/24","v":"2022-04-29T21:07:48"},{"$f":"C225","v":"2022-04-29T21:08:30"},null,"TLM mode change (MODE_10)","TLM_MODE_10",{"$f":"VLOOKUP(G224,List!B:C,2,0)","v":42},null,null,{"$f":"VLOOKUP(G224,List!B:E,4,0)","v":"dcsm-EF_BUS_TLM_MODE_10"},{"$f":"VLOOKUP(G224,List!B:G,6,0)","v":2},"2022-04-29T21:02:31",{"$f":"+\"0000    CALL \"&K224&\" -Run\"","v":"0000    CALL dcsm-EF_BUS_TLM_MODE_10 -Run"},null,null,4.8611110833007842E-4,4.8611110833007842E-4,2.1990740715409629E-3]
[null,null,{"$f":"D225-H225/3600/24","v":"2022-04-29T21:08:30"},{"$f":"C226","v":"2022-04-29T21:11:40"},null,"SI HV OFF","HEP_HV_OFF",{"$f":"VLOOKUP(G225,List!B:C,2,0)","v":190},null,null,{"$f":"VLOOKUP(G225,List!B:E,4,0)","v":"dcsm-EF_HEPE_HV_OFF_OBS_OFF"},{"$f":"VLOOKUP(G225,List!B:G,6,0)","v":5},"2022-04-29T21:03:13","0000    CALL dcsm-EF_HEPE_HV_OFF_OBS_OFF -Run",null,null,2.1990740715409629E-3,2.1990740715409629E-3,2.2916666639503092E-3]
[null,null,{"$f":"D226-H226/3600/24","v":"2022-04-29T21:11:40"},{"$f":"C227","v":"2022-04-29T21:14:58"},null,null,"ENA_HV_OFF",{"$f":"VLOOKUP(G226,List!B:C,2,0)","v":198},null,null,{"$f":"VLOOKUP(G226,List!B:E,4,0)","v":"dcsm-EF_ENA_HV_OFF"},{"$f":"VLOOKUP(G226,List!B:G,6,0)","v":4},"2022-04-29T21:06:23","0000    CALL dcsm-EF_ENA_HV_OFF -Run",null,null,2.2916666639503092E-3,2.2916666639503092E-3,6.944444467080757E-4]
[null,null,"2022-04-29T21:14:58","2022-04-29T21:15:58",null,null,"MIA_HV_OFF",{"$f":"VLOOKUP(G227,List!B:C,2,0)","v":60},null,null,{"$f":"VLOOKUP(G227,List!B:E,4,0)","v":"dcsm-EF_MIA_HV_OFF"},{"$f":"VLOOKUP(G227,List!B:G,6,0)","v":1},"2022-04-29T21:09:41","0000    CALL dcsm-EF_MIA_HV_OFF -Run",null,null,6.944444467080757E-4,6.944444467080757E-4,2.1064814791316167E-3]
[null,null,"2022-04-29T21:15:58","2022-04-29T21:19:00",null,null,"MEA1_HV_OFF",{"$f":"VLOOKUP(G228,List!B:C,2,0)","v":182},null,null,{"$f":"VLOOKUP(G228,List!B:E,4,0)","v":"dcsm-EF_MEA1_HV_OFF"},{"$f":"VLOOKUP(G228,List!B:G,6,0)","v":10},"2022-04-29T21:10:41","0000    CALL dcsm-EF_MEA1_HV_OFF -Run",null,null,2.1064814791316167E-3,2.1064814791316167E-3,8.9583333319751546E-3]
[null,null,"2022-04-29T21:19:00","2022-04-29T21:31:54",null,null,"MSA_HV_OFF_VFB",{"$f":"VLOOKUP(G229,List!B:C,2,0)","v":774},null,null,{"$f":"VLOOKUP(G229,List!B:E,4,0)","v":"dcsm-EF_MSA_HV_OFF_VFB"},{"$f":"VLOOKUP(G229,List!B:G,6,0)","v":25},"2022-04-29T21:13:43","0000    CALL dcsm-EF_MSA_HV_OFF_VFB -Run",null,null,8.9583333319751546E-3,8.9583333319751546E-3,1.3888888890505768E-2]
[null,null,"2022-04-29T21:31:54",{"$f":"C230+H230/3600/24","v":"2022-04-29T21:51:54"},"WOL#18",null,{"$f":"(C231-D229)*24*3600","v":1800.0000002095476},1200,null,null,null,0,"2022-04-29T21:26:37",{"$f":"\"0000    WAIT_SEC  \"&TEXT(G230,\"#0\")","v":"0000    WAIT_SEC  1800"},null,null,1.3888888890505768E-2,2.0833333335758653E-2,1.0069444448163267E-2]
[null,null,{"$f":"D230+10/60/24","v":"2022-04-29T22:01:54"},{"$f":"C231+H231/3600/24","v":"2022-04-29T22:06:24"},null,"SI HV ON","HEP_HV_ON",{"$f":"VLOOKUP(G231,List!B:C,2,0)","v":270},null,null,{"$f":"VLOOKUP(G231,List!B:E,4,0)","v":"dcsm-EF_HEPE_HV_ON_OBS_START"},{"$f":"VLOOKUP(G231,List!B:G,6,0)","v":6},"2022-04-29T21:56:37",{"$f":"+\"0000    CALL \"&K231&\" -Run\"","v":"0000    CALL dcsm-EF_HEPE_HV_ON_OBS_START -Run"},null,null,3.125000002910383E-3,3.125000002910383E-3,3.9814814808778465E-3]
[null,null,{"$f":"D231","v":"2022-04-29T22:06:24"},"2022-04-29T22:12:08",null,null,"ENA_HV_ON_CNT",{"$f":"VLOOKUP(G232,List!B:C,2,0)","v":344},null,null,{"$f":"VLOOKUP(G232,List!B:E,4,0)","v":"dcsm-EF_ENA_HV_ON_CNT"},{"$f":"VLOOKUP(G232,List!B:G,6,0)","v":18},"2022-04-29T22:01:07",{"$f":"+\"0000    CALL \"&K232&\" -Run\"","v":"0000    CALL dcsm-EF_ENA_HV_ON_CNT -Run"},null,null,3.9814814808778465E-3,3.9814814808778465E-3,3.0324074105010368E-3]
[null,null,"2022-04-29T22:12:08","2022-04-29T22:16:30",null,null,"MIA_HV_ON_SW_RC",{"$f":"VLOOKUP(G233,List!B:C,2,0)","v":262},null,null,{"$f":"VLOOKUP(G233,List!B:E,4,0)","v":"dcsm-EF_MIA_HV_ON_SW_RC"},{"$f":"VLOOKUP(G233,List!B:G,6,0)","v":7},"2022-04-29T22:06:51","0000    CALL dcsm-EF_MIA_HV_ON_SW_RC -Run",null,null,3.0324074105010368E-3,3.0324074105010368E-3,1.9699074073287193E-2]
[null,null,"2022-04-29T22:16:30","2022-04-29T22:44:52",null,null,"MEA1_HV_ON",{"$f":"VLOOKUP(G234,List!B:C,2,0)","v":1702},null,null,{"$f":"VLOOKUP(G234,List!B:E,4,0)","v":"dcsm-EF_MEA1_HV_ON"},{"$f":"VLOOKUP(G234,List!B:G,6,0)","v":27},"2022-04-29T22:11:13","0000    CALL dcsm-EF_MEA1_HV_ON -Run",null,null,1.9699074073287193E-2,1.9699074073287193E-2,1.8206018517958E-2]
[null,null,"2022-04-29T22:44:52","2022-04-29T23:11:05",null,null,"MSA_HV_ON_1_MFB_SF",{"$f":"VLOOKUP(G235,List!B:C,2,0)","v":1573},null,null,{"$f":"VLOOKUP(G235,List!B:E,4,0)","v":"dcsm-EF_MSA_HV_ON_1_MFB_Safe"},{"$f":"VLOOKUP(G235,List!B:G,6,0)","v":108},"2022-04-29T22:39:35","0000    CALL dcsm-EF_MSA_HV_ON_1_MFB_Safe -Run",null,null,1.8206018517958E-2,1.8206018517958E-2,2.1527777775190771E-2]
[null,null,"2022-04-29T23:11:05","2022-04-29T23:42:05",null,null,"MSA_HV_ON_2_MFB_SF",{"$f":"VLOOKUP(G236,List!B:C,2,0)","v":1860},null,null,{"$f":"VLOOKUP(G236,List!B:E,4,0)","v":"dcsm-EF_MSA_HV_ON_2_MFB_Safe"},{"$f":"VLOOKUP(G236,List!B:G,6,0)","v":124},"2022-04-29T23:05:48","0000    CALL dcsm-EF_MSA_HV_ON_2_MFB_Safe -Run",null,null,2.1527777775190771E-2,2.1527777775190771E-2,4.8611110833007842E-4]
[null,null,"2022-04-29T23:42:05","2022-04-29T23:42:47",null,"TLM mode change (MODE_5)","TLM_MODE_5",{"$f":"VLOOKUP(G237,List!B:C,2,0)","v":42},null,null,{"$f":"VLOOKUP(G237,List!B:E,4,0)","v":"dcsm-EF_BUS_TLM_MODE_5"},{"$f":"VLOOKUP(G237,List!B:G,6,0)","v":2},"2022-04-29T23:36:48","0000    CALL dcsm-EF_BUS_TLM_MODE_5 -Run",null,null,4.8611110833007842E-4,4.8611110833007842E-4,0.68835648149251938]
[null,null,"2022-04-29T23:42:47",{"$f":"C239","v":"2022-04-30T16:14:01"},"Observation T",null,null,{"$f":"(D238-C238)*3600*24","v":59474.000000953674},{"$f":"H238/3600","v":16.520555555820465},null,null,0,"2022-04-29T23:37:30",{"$f":"\"0000    WAIT_SEC  \"&TEXT(H238,\"#0\")","v":"0000    WAIT_SEC  59474"},null,null,0.68835648149251938,0.68835648149251938,4.8611110833007842E-4]
[null,null,{"$f":"D239-H239/3600/24","v":"2022-04-30T16:14:01"},{"$f":"C240","v":"2022-04-30T16:14:43"},null,"TLM mode change (MODE_10)","TLM_MODE_10",{"$f":"VLOOKUP(G239,List!B:C,2,0)","v":42},null,null,{"$f":"VLOOKUP(G239,List!B:E,4,0)","v":"dcsm-EF_BUS_TLM_MODE_10"},{"$f":"VLOOKUP(G239,List!B:G,6,0)","v":2},"2022-04-30T16:08:44",{"$f":"+\"0000    CALL \"&K239&\" -Run\"","v":"0000    CALL dcsm-EF_BUS_TLM_MODE_10 -Run"},null,null,4.8611110833007842E-4,4.8611110833007842E-4,2.1990740715409629E-3]
[null,null,{"$f":"D240-H240/3600/24","v":"2022-04-30T16:14:43"},{"$f":"C241","v":"2022-04-30T16:17:53"},null,"SI HV OFF","HEP_HV_OFF",{"$f":"VLOOKUP(G240,List!B:C,2,0)","v":190},null,null,{"$f":"VLOOKUP(G240,List!B:E,4,0)","v":"dcsm-EF_HEPE_HV_OFF_OBS_OFF"},{"$f":"VLOOKUP(G240,List!B:G,6,0)","v":5},"2022-04-30T16:09:26","0000    CALL dcsm-EF_HEPE_HV_OFF_OBS_OFF -Run",null,null,2.1990740715409629E-3,2.1990740715409629E-3,2.2916666639503092E-3]
[null,null,{"$f":"D241-H241/3600/24","v":"2022-04-30T16:17:53"},{"$f":"C242","v":"2022-04-30T16:21:11"},null,null,"ENA_HV_OFF",{"$f":"VLOOKUP(G241,List!B:C,2,0)","v":198},null,null,{"$f":"VLOOKUP(G241,List!B:E,4,0)","v":"dcsm-EF_ENA_HV_OFF"},{"$f":"VLOOKUP(G241,List!B:G,6,0)","v":4},"2022-04-30T16:12:36","0000    CALL dcsm-EF_ENA_HV_OFF -Run",null,null,2.2916666639503092E-3,2.2916666639503092E-3,6.944444467080757E-4]
[null,null,"2022-04-30T16:21:11","2022-04-30T16:22:11",null,null,"MIA_HV_OFF",{"$f":"VLOOKUP(G242,List!B:C,2,0)","v":60},null,null,{"$f":"VLOOKUP(G242,List!B:E,4,0)","v":"dcsm-EF_MIA_HV_OFF"},{"$f":"VLOOKUP(G242,List!B:G,6,0)","v":1},"2022-04-30T16:15:54","0000    CALL dcsm-EF_MIA_HV_OFF -Run",null,null,6.944444467080757E-4,6.944444467080757E-4,2.1064814791316167E-3]
[null,null,"2022-04-30T16:22:11","2022-04-30T16:25:13",null,null,"MEA1_HV_OFF",{"$f":"VLOOKUP(G243,List!B:C,2,0)","v":182},null,null,{"$f":"VLOOKUP(G243,List!B:E,4,0)","v":"dcsm-EF_MEA1_HV_OFF"},{"$f":"VLOOKUP(G243,List!B:G,6,0)","v":10},"2022-04-30T16:16:54","0000    CALL dcsm-EF_MEA1_HV_OFF -Run",null,null,2.1064814791316167E-3,2.1064814791316167E-3,8.9583333319751546E-3]
[null,null,"2022-04-30T16:25:13","2022-04-30T16:38:07",null,null,"MSA_HV_OFF_VFB",{"$f":"VLOOKUP(G244,List!B:C,2,0)","v":774},null,null,{"$f":"VLOOKUP(G244,List!B:E,4,0)","v":"dcsm-EF_MSA_HV_OFF_VFB"},{"$f":"VLOOKUP(G244,List!B:G,6,0)","v":25},"2022-04-30T16:19:56","0000    CALL dcsm-EF_MSA_HV_OFF_VFB -Run",null,null,8.9583333319751546E-3,8.9583333319751546E-3,1.3888888890505768E-2]
[null,null,"2022-04-30T16:38:07",{"$f":"C245+H245/3600/24","v":"2022-04-30T16:58:07"},"WOL#19",null,{"$f":"(C246-D244)*24*3600","v":1800.0000002095476},1200,null,null,null,0,"2022-04-30T16:32:50",{"$f":"\"0000    WAIT_SEC  \"&TEXT(G245,\"#0\")","v":"0000    WAIT_SEC  1800"},null,null,1.3888888890505768E-2,2.0833333335758653E-2,1.0069444448163267E-2]
[null,null,{"$f":"D245+10/60/24","v":"2022-04-30T17:08:07"},{"$f":"C246+H246/3600/24","v":"2022-04-30T17:12:37"},null,"SI HV ON","HEP_HV_ON",{"$f":"VLOOKUP(G246,List!B:C,2,0)","v":270},null,null,{"$f":"VLOOKUP(G246,List!B:E,4,0)","v":"dcsm-EF_HEPE_HV_ON_OBS_START"},{"$f":"VLOOKUP(G246,List!B:G,6,0)","v":6},"2022-04-30T17:02:50",{"$f":"+\"0000    CALL \"&K246&\" -Run\"","v":"0000    CALL dcsm-EF_HEPE_HV_ON_OBS_START -Run"},null,null,3.125000002910383E-3,3.125000002910383E-3,3.9814814808778465E-3]
[null,null,{"$f":"D246","v":"2022-04-30T17:12:37"},"2022-04-30T17:18:21",null,null,"ENA_HV_ON_CNT",{"$f":"VLOOKUP(G247,List!B:C,2,0)","v":344},null,null,{"$f":"VLOOKUP(G247,List!B:E,4,0)","v":"dcsm-EF_ENA_HV_ON_CNT"},{"$f":"VLOOKUP(G247,List!B:G,6,0)","v":18},"2022-04-30T17:07:20",{"$f":"+\"0000    CALL \"&K247&\" -Run\"","v":"0000    CALL dcsm-EF_ENA_HV_ON_CNT -Run"},null,null,3.9814814808778465E-3,3.9814814808778465E-3,3.0324074105010368E-3]
[null,null,"2022-04-30T17:18:21","2022-04-30T17:22:43",null,null,"MIA_HV_ON_SW_RC",{"$f":"VLOOKUP(G248,List!B:C,2,0)","v":262},null,null,{"$f":"VLOOKUP(G248,List!B:E,4,0)","v":"dcsm-EF_MIA_HV_ON_SW_RC"},{"$f":"VLOOKUP(G248,List!B:G,6,0)","v":7},"2022-04-30T17:13:04","0000    CALL dcsm-EF_MIA_HV_ON_SW_RC -Run",null,null,3.0324074105010368E-3,3.0324074105010368E-3,1.9699074073287193E-2]
[null,null,"2022-04-30T17:22:43","2022-04-30T17:51:05",null,null,"MEA1_HV_ON",{"$f":"VLOOKUP(G249,List!B:C,2,0)","v":1702},null,null,{"$f":"VLOOKUP(G249,List!B:E,4,0)","v":"dcsm-EF_MEA1_HV_ON"},{"$f":"VLOOKUP(G249,List!B:G,6,0)","v":27},"2022-04-30T17:17:26","0000    CALL dcsm-EF_MEA1_HV_ON -Run",null,null,1.9699074073287193E-2,1.9699074073287193E-2,1.8206018517958E-2]
[null,null,"2022-04-30T17:51:05","2022-04-30T18:17:18",null,null,"MSA_HV_ON_1_MFB_SF",{"$f":"VLOOKUP(G250,List!B:C,2,0)","v":1573},null,null,{"$f":"VLOOKUP(G250,List!B:E,4,0)","v":"dcsm-EF_MSA_HV_ON_1_MFB_Safe"},{"$f":"VLOOKUP(G250,List!B:G,6,0)","v":108},"2022-04-30T17:45:48","0000    CALL dcsm-EF_MSA_HV_ON_1_MFB_Safe -Run",null,null,1.8206018517958E-2,1.8206018517958E-2,2.1527777775190771E-2]
[null,null,"2022-04-30T18:17:18","2022-04-30T18:48:18",null,null,"MSA_HV_ON_2_MFB_SF",{"$f":"VLOOKUP(G251,List!B:C,2,0)","v":1860},null,null,{"$f":"VLOOKUP(G251,List!B:E,4,0)","v":"dcsm-EF_MSA_HV_ON_2_MFB_Safe"},{"$f":"VLOOKUP(G251,List!B:G,6,0)","v":124},"2022-04-30T18:12:01","0000    CALL dcsm-EF_MSA_HV_ON_2_MFB_Safe -Run",null,null,2.1527777775190771E-2,2.1527777775190771E-2,4.8611110833007842E-4]
[null,null,"2022-04-30T18:48:18","2022-04-30T18:49:00",null,"TLM mode change (MODE_5)","TLM_MODE_5",{"$f":"VLOOKUP(G252,List!B:C,2,0)","v":42},null,null,{"$f":"VLOOKUP(G252,List!B:E,4,0)","v":"dcsm-EF_BUS_TLM_MODE_5"},{"$f":"VLOOKUP(G252,List!B:G,6,0)","v":2},"2022-04-30T18:43:01","0000    CALL dcsm-EF_BUS_TLM_MODE_5 -Run",null,null,4.8611110833007842E-4,4.8611110833007842E-4,0.18731481481518131]
[null,null,"2022-04-30T18:49:00",{"$f":"C254","v":"2022-04-30T23:18:44"},"Observation U",null,null,{"$f":"(D253-C253)*3600*24","v":16184.000000031665},{"$f":"H253/3600","v":4.4955555555643514},null,null,0,"2022-04-30T18:43:43",{"$f":"\"0000    WAIT_SEC  \"&TEXT(H253,\"#0\")","v":"0000    WAIT_SEC  16184"},null,null,0.18731481481518131,0.18731481481518131,4.8611110833007842E-4]
[null,null,{"$f":"D254-H254/3600/24","v":"2022-04-30T23:18:44"},{"$f":"C255","v":"2022-04-30T23:19:26"},null,"TLM mode change (MODE_10)","TLM_MODE_10",{"$f":"VLOOKUP(G254,List!B:C,2,0)","v":42},null,null,{"$f":"VLOOKUP(G254,List!B:E,4,0)","v":"dcsm-EF_BUS_TLM_MODE_10"},{"$f":"VLOOKUP(G254,List!B:G,6,0)","v":2},"2022-04-30T23:13:27",{"$f":"+\"0000    CALL \"&K254&\" -Run\"","v":"0000    CALL dcsm-EF_BUS_TLM_MODE_10 -Run"},null,null,4.8611110833007842E-4,4.8611110833007842E-4,2.1990740715409629E-3]
[null,null,{"$f":"D255-H255/3600/24","v":"2022-04-30T23:19:26"},{"$f":"C256","v":"2022-04-30T23:22:36"},null,"SI HV OFF","HEP_HV_OFF",{"$f":"VLOOKUP(G255,List!B:C,2,0)","v":190},null,null,{"$f":"VLOOKUP(G255,List!B:E,4,0)","v":"dcsm-EF_HEPE_HV_OFF_OBS_OFF"},{"$f":"VLOOKUP(G255,List!B:G,6,0)","v":5},"2022-04-30T23:14:09","0000    CALL dcsm-EF_HEPE_HV_OFF_OBS_OFF -Run",null,null,2.1990740715409629E-3,2.1990740715409629E-3,2.2916666639503092E-3]
[null,null,{"$f":"D256-H256/3600/24","v":"2022-04-30T23:22:36"},{"$f":"C257","v":"2022-04-30T23:25:54"},null,null,"ENA_HV_OFF",{"$f":"VLOOKUP(G256,List!B:C,2,0)","v":198},null,null,{"$f":"VLOOKUP(G256,List!B:E,4,0)","v":"dcsm-EF_ENA_HV_OFF"},{"$f":"VLOOKUP(G256,List!B:G,6,0)","v":4},"2022-04-30T23:17:19","0000    CALL dcsm-EF_ENA_HV_OFF -Run",null,null,{"$f":"+D256-C256","v":2.2916666639503092E-3},{"$f":"+C257-C256","v":2.2916666639503092E-3},6.944444467080757E-4]
[null,null,"2022-04-30T23:25:54","2022-04-30T23:26:54",null,null,"MIA_HV_OFF",{"$f":"VLOOKUP(G257,List!B:C,2,0)","v":60},null,null,{"$f":"VLOOKUP(G257,List!B:E,4,0)","v":"dcsm-EF_MIA_HV_OFF"},{"$f":"VLOOKUP(G257,List!B:G,6,0)","v":1},"2022-04-30T23:20:37","0000    CALL dcsm-EF_MIA_HV_OFF -Run",null,null,6.944444467080757E-4,6.944444467080757E-4,2.1527777789742686E-3]
[null,null,"2022-04-30T23:26:54","2022-04-30T23:30:00",null,null,"MEA1_HV_SCAN_OFF",{"$f":"VLOOKUP(G258,List!B:C,2,0)","v":186},null,null,{"$f":"VLOOKUP(G258,List!B:E,4,0)","v":"dcsm-EF_MEA1_HV_SCAN_OFF"},{"$f":"VLOOKUP(G258,List!B:G,6,0)","v":12},"2022-04-30T23:21:37","0000    CALL dcsm-EF_MEA1_HV_SCAN_OFF -Run",null,null,2.1527777789742686E-3,2.1527777789742686E-3,8.9583333319751546E-3]
[null,null,"2022-04-30T23:30:00","2022-04-30T23:42:54",null,null,"MSA_HV_OFF_VFB",{"$f":"VLOOKUP(G259,List!B:C,2,0)","v":774},null,null,{"$f":"VLOOKUP(G259,List!B:E,4,0)","v":"dcsm-EF_MSA_HV_OFF_VFB"},{"$f":"VLOOKUP(G259,List!B:G,6,0)","v":25},"2022-04-30T23:24:43","0000    CALL dcsm-EF_MSA_HV_OFF_VFB -Run",null,null,8.9583333319751546E-3,8.9583333319751546E-3,8.1018518540076911E-4]
[null,null,"2022-04-30T23:42:54","2022-04-30T23:44:04",null,"SI OFF","HEP_OFF",{"$f":"VLOOKUP(G260,List!B:C,2,0)","v":70},null,null,{"$f":"VLOOKUP(G260,List!B:E,4,0)","v":"dcsm-EF_HEPE_OFF_STOP"},{"$f":"VLOOKUP(G260,List!B:G,6,0)","v":4},"2022-04-30T23:37:37",{"$f":"+\"0000    CALL \"&K260&\" -Run\"","v":"0000    CALL dcsm-EF_HEPE_OFF_STOP -Run"},null,null,8.1018518540076911E-4,8.1018518540076911E-4,1.8518518554628827E-3]
[null,null,"2022-04-30T23:44:04","2022-04-30T23:46:44",null,null,"MIA_OFF",{"$f":"VLOOKUP(G261,List!B:C,2,0)","v":160},null,null,{"$f":"VLOOKUP(G261,List!B:E,4,0)","v":"dcsm-EF_MIA_OFF"},{"$f":"VLOOKUP(G261,List!B:G,6,0)","v":4},"2022-04-30T23:38:47",{"$f":"+\"0000    CALL \"&K261&\" -Run\"","v":"0000    CALL dcsm-EF_MIA_OFF -Run"},null,null,1.8518518554628827E-3,1.8518518554628827E-3,1.8518518554628827E-3]
[null,null,"2022-04-30T23:46:44","2022-04-30T23:49:24",null,null,"MEA1_OFF",{"$f":"VLOOKUP(G262,List!B:C,2,0)","v":160},null,null,{"$f":"VLOOKUP(G262,List!B:E,4,0)","v":"dcsm-EF_MEA1_OFF"},{"$f":"VLOOKUP(G262,List!B:G,6,0)","v":4},"2022-04-30T23:41:27","0000    CALL dcsm-EF_MEA1_OFF -Run",null,null,1.8518518554628827E-3,1.8518518554628827E-3,9.2592592409346253E-5]
[null,null,"2022-04-30T23:49:24","2022-04-30T23:49:32",null,null,"MGF_OFF",{"$f":"VLOOKUP(G263,List!B:C,2,0)","v":8},null,null,{"$f":"VLOOKUP(G263,List!B:E,4,0)","v":"dcsm-EF_MGF_OFF"},{"$f":"VLOOKUP(G263,List!B:G,6,0)","v":1},{"$f":"C263-317/3600/24","v":"2022-04-30T23:44:07"},"0000    CALL dcsm-EF_MGF_OFF -Run",null,null,9.2592592409346253E-5,9.2592592409346253E-5,4.6296296204673126E-4]
[null,null,"2022-04-30T23:49:32","2022-04-30T23:50:12",null,null,"PME_OFF",{"$f":"VLOOKUP(G264,List!B:C,2,0)","v":40},null,null,{"$f":"VLOOKUP(G264,List!B:E,4,0)","v":"dcsm-EF_PME_OFF"},{"$f":"VLOOKUP(G264,List!B:G,6,0)","v":1},"2022-04-30T23:44:15","0000    CALL dcsm-EF_PME_OFF -Run",null,null,4.6296296204673126E-4,4.6296296204673126E-4,1.0185185165028088E-3]
[null,null,"2022-04-30T23:50:12","2022-04-30T23:51:40",null,null,"ENA_OFF",{"$f":"VLOOKUP(G265,List!B:C,2,0)","v":88},null,null,{"$f":"VLOOKUP(G265,List!B:E,4,0)","v":"dcsm-EF_ENA_power_OFF"},{"$f":"VLOOKUP(G265,List!B:G,6,0)","v":4},"2022-04-30T23:44:55","0000    CALL dcsm-EF_ENA_power_OFF -Run",null,null,1.0185185165028088E-3,1.0185185165028088E-3,4.3981481503578834E-3]
[null,null,"2022-04-30T23:51:40","2022-04-30T23:58:00",null,null,"MSA_OFF",{"$f":"VLOOKUP(G266,List!B:C,2,0)","v":380},null,null,{"$f":"VLOOKUP(G266,List!B:E,4,0)","v":"dcsm-EF_MSA_OFF"},{"$f":"VLOOKUP(G266,List!B:G,6,0)","v":25},"2022-04-30T23:46:23","0000    CALL dcsm-EF_MSA_OFF -Run",null,null,4.3981481503578834E-3,4.3981481503578834E-3,1.3888888861401938E-3]
[null,null,"2022-04-30T23:58:00","2022-05-01",null,"MDP OFF","MDP_OFF_D",{"$f":"VLOOKUP(G267,List!B:C,2,0)","v":120},null,null,{"$f":"VLOOKUP(G267,List!B:E,4,0)","v":"dcsm-EF_MDP_POWEROFF"},{"$f":"VLOOKUP(G267,List!B:G,6,0)","v":3},"2022-04-30T23:52:43","0000    CALL dcsm-EF_MDP_POWEROFF -Run",null,null,1.3888888861401938E-3,1.3888888861401938E-3,5.8912037056870759E-3]
[null,null,"2022-05-01",{"$f":"C268+H268/3600/24","v":"2022-05-01T00:08:29"},null,"MDP ON","MDP_ON_D",{"$f":"VLOOKUP(G268,List!B:C,2,0)","v":509},null,null,{"$f":"VLOOKUP(G268,List!B:E,4,0)","v":"dcsm-EF_MDP_ON"},{"$f":"VLOOKUP(G268,List!B:G,6,0)","v":11},"2022-04-30T23:54:43","0000    CALL dcsm-EF_MDP_ON -Run",null,null,{"$f":"+D268-C268","v":5.8912037056870759E-3},{"$f":"+C269-C268","v":5.8912037056870759E-3},{"$f":"+D269-D268","v":4.8611110833007842E-4}]
[null,null,{"$f":"D268","v":"2022-05-01T00:08:29"},{"$f":"C269+H269/3600/24","v":"2022-05-01T00:09:11"},null,null,"MDP_CRUISE_SET",{"$f":"VLOOKUP(G269,List!B:C,2,0)","v":42},null,null,{"$f":"VLOOKUP(G269,List!B:E,4,0)","v":"dcsm-EF_MDP_CRUISE_SET"},{"$f":"VLOOKUP(G269,List!B:G,6,0)","v":2},"2022-05-01T00:03:12","0000    CALL dcsm-EF_MDP_CRUISE_SET -Run",null,null,{"$f":"+D269-C269","v":4.8611110833007842E-4},{"$f":"+C270-C269","v":4.8611110833007842E-4},4.8611110833007842E-4]
[null,null,{"$f":"D269","v":"2022-05-01T00:09:11"},{"$f":"C270+H270/3600/24","v":"2022-05-01T00:09:53"},null,"TLM mode change (MODE_10)","TLM_MODE_10",{"$f":"VLOOKUP(G270,List!B:C,2,0)","v":42},null,null,{"$f":"VLOOKUP(G270,List!B:E,4,0)","v":"dcsm-EF_BUS_TLM_MODE_10"},{"$f":"VLOOKUP(G270,List!B:G,6,0)","v":2},"2022-05-01T00:03:54","0000    CALL dcsm-EF_BUS_TLM_MODE_10 -Run",null,null,4.8611110833007842E-4,4.8611110833007842E-4,3.379629626579117E-3]
[null,null,"2022-05-01T00:09:53","2022-05-01T00:14:45",null,"SI ON","MEA1_ON_SETUP_SW",{"$f":"VLOOKUP(G271,List!B:C,2,0)","v":292},null,null,{"$f":"VLOOKUP(G271,List!B:E,4,0)","v":"dcsm-EF_MEA1_ON_SW"},{"$f":"VLOOKUP(G271,List!B:G,6,0)","v":12},"2022-05-01T00:04:36","0000    CALL dcsm-EF_MEA1_ON_SW -Run",null,null,3.379629626579117E-3,3.379629626579117E-3,1.4236111113859806E-2]
[null,null,"2022-05-01T00:14:45","2022-05-01T00:35:15",null,null,"HEP_ON_SETUP",{"$f":"VLOOKUP(G272,List!B:C,2,0)","v":1230},null,null,{"$f":"VLOOKUP(G272,List!B:E,4,0)","v":"dcsm-EF_HEP_ON_START_for_TL"},{"$f":"VLOOKUP(G272,List!B:G,6,0)","v":34},"2022-05-01T00:09:28","0000    CALL dcsm-EF_HEP_ON_START_for_TL -Run",null,null,1.4236111113859806E-2,1.4236111113859806E-2,9.2592592409346253E-4]
[null,null,"2022-05-01T00:35:15","2022-05-01T00:36:35",null,null,"PME_ON",{"$f":"VLOOKUP(G273,List!B:C,2,0)","v":80},null,null,{"$f":"VLOOKUP(G273,List!B:E,4,0)","v":"dcsm-EF_PME_ON"},{"$f":"VLOOKUP(G273,List!B:G,6,0)","v":2},"2022-05-01T00:29:58","0000    CALL dcsm-EF_PME_ON -Run",null,null,9.2592592409346253E-4,9.2592592409346253E-4,1.6203703853534535E-4]
[null,null,"2022-05-01T00:36:35","2022-05-01T00:36:49",null,null,"MGF_ON_SETUP",{"$f":"VLOOKUP(G274,List!B:C,2,0)","v":14},null,null,{"$f":"VLOOKUP(G274,List!B:E,4,0)","v":"dcsm-EF_MGF_ON"},{"$f":"VLOOKUP(G274,List!B:G,6,0)","v":3},"2022-05-01T00:31:18","0000    CALL dcsm-EF_MGF_ON -Run",null,null,1.6203703853534535E-4,1.6203703853534535E-4,6.5277777757728472E-3]
[null,null,"2022-05-01T00:36:49","2022-05-01T00:46:13",null,null,"ENA_ON_SETUP",{"$f":"VLOOKUP(G275,List!B:C,2,0)","v":564},null,null,{"$f":"VLOOKUP(G275,List!B:E,4,0)","v":"dcsm-EF_ENA_power_ON"},{"$f":"VLOOKUP(G275,List!B:G,6,0)","v":7},"2022-05-01T00:31:32","0000    CALL dcsm-EF_ENA_power_ON -Run",null,null,6.5277777757728472E-3,6.5277777757728472E-3,3.125000002910383E-3]
[null,null,{"$f":"D275","v":"2022-05-01T00:46:13"},"2022-05-01T00:50:43",null,"SI HV ON","HEP_HV_ON",{"$f":"VLOOKUP(G276,List!B:C,2,0)","v":270},null,null,{"$f":"VLOOKUP(G276,List!B:E,4,0)","v":"dcsm-EF_HEPE_HV_ON_OBS_START"},{"$f":"VLOOKUP(G276,List!B:G,6,0)","v":6},"2022-05-01T00:40:56",{"$f":"+\"0000    CALL \"&K276&\" -Run\"","v":"0000    CALL dcsm-EF_HEPE_HV_ON_OBS_START -Run"},null,null,3.125000002910383E-3,3.125000002910383E-3,3.9814814808778465E-3]
[null,null,{"$f":"D276","v":"2022-05-01T00:50:43"},"2022-05-01T00:56:27",null,null,"ENA_HV_ON_CNT",{"$f":"VLOOKUP(G277,List!B:C,2,0)","v":344},null,null,{"$f":"VLOOKUP(G277,List!B:E,4,0)","v":"dcsm-EF_ENA_HV_ON_CNT"},{"$f":"VLOOKUP(G277,List!B:G,6,0)","v":18},"2022-05-01T00:45:26",{"$f":"+\"0000    CALL \"&K277&\" -Run\"","v":"0000    CALL dcsm-EF_ENA_HV_ON_CNT -Run"},null,null,3.9814814808778465E-3,3.9814814808778465E-3,1.9699074073287193E-2]
[null,null,"2022-05-01T00:56:27","2022-05-01T01:24:49",null,null,"MEA1_HV_ON",{"$f":"VLOOKUP(G278,List!B:C,2,0)","v":1702},null,null,{"$f":"VLOOKUP(G278,List!B:E,4,0)","v":"dcsm-EF_MEA1_HV_ON"},{"$f":"VLOOKUP(G278,List!B:G,6,0)","v":27},"2022-05-01T00:51:10","0000    CALL dcsm-EF_MEA1_HV_ON -Run",null,null,1.9699074073287193E-2,1.9699074073287193E-2,4.8611110833007842E-4]
[null,null,"2022-05-01T01:24:49","2022-05-01T01:25:31",null,"TLM mode change (MODE_5)","TLM_MODE_5",{"$f":"VLOOKUP(G279,List!B:C,2,0)","v":42},null,null,{"$f":"VLOOKUP(G279,List!B:E,4,0)","v":"dcsm-EF_BUS_TLM_MODE_5"},{"$f":"VLOOKUP(G279,List!B:G,6,0)","v":2},"2022-05-01T01:19:32","0000    CALL dcsm-EF_BUS_TLM_MODE_5 -Run",null,null,4.8611110833007842E-4,4.8611110833007842E-4,0.28258101853862172]
[null,null,"2022-05-01T01:25:31",{"$f":"C281","v":"2022-05-01T08:12:26"},"Observation V",null,null,{"$f":"(D280-C280)*3600*24","v":24415.000001736917},{"$f":"H280/3600","v":6.7819444449269213},null,null,0,"2022-05-01T01:20:14",{"$f":"\"0000    WAIT_SEC  \"&TEXT(H280,\"#0\")","v":"0000    WAIT_SEC  24415"},null,null,0.28258101853862172,0.28258101853862172,4.8611110833007842E-4]
[null,null,{"$f":"D281-H281/3600/24","v":"2022-05-01T08:12:26"},{"$f":"C282","v":"2022-05-01T08:13:08"},null,"TLM mode change (MODE_10)","TLM_MODE_10",{"$f":"VLOOKUP(G281,List!B:C,2,0)","v":42},null,null,{"$f":"VLOOKUP(G281,List!B:E,4,0)","v":"dcsm-EF_BUS_TLM_MODE_10"},{"$f":"VLOOKUP(G281,List!B:G,6,0)","v":2},"2022-05-01T08:07:09",{"$f":"+\"0000    CALL \"&K281&\" -Run\"","v":"0000    CALL dcsm-EF_BUS_TLM_MODE_10 -Run"},null,null,4.8611110833007842E-4,4.8611110833007842E-4,2.1990740715409629E-3]
[null,null,{"$f":"D282-H282/3600/24","v":"2022-05-01T08:13:08"},{"$f":"C283","v":"2022-05-01T08:16:18"},null,"SI HV OFF","HEP_HV_OFF",{"$f":"VLOOKUP(G282,List!B:C,2,0)","v":190},null,null,{"$f":"VLOOKUP(G282,List!B:E,4,0)","v":"dcsm-EF_HEPE_HV_OFF_OBS_OFF"},{"$f":"VLOOKUP(G282,List!B:G,6,0)","v":5},"2022-05-01T08:07:51","0000    CALL dcsm-EF_HEPE_HV_OFF_OBS_OFF -Run",null,null,{"$f":"+D282-C282","v":2.1990740715409629E-3},2.1990740715409629E-3,2.2916666639503092E-3]
[null,null,{"$f":"D283-H283/3600/24","v":"2022-05-01T08:16:18"},{"$f":"C284","v":"2022-05-01T08:19:36"},null,null,"ENA_HV_OFF",{"$f":"VLOOKUP(G283,List!B:C,2,0)","v":198},null,null,{"$f":"VLOOKUP(G283,List!B:E,4,0)","v":"dcsm-EF_ENA_HV_OFF"},{"$f":"VLOOKUP(G283,List!B:G,6,0)","v":4},"2022-05-01T08:11:01","0000    CALL dcsm-EF_ENA_HV_OFF -Run",null,null,2.2916666639503092E-3,2.2916666639503092E-3,2.1064814791316167E-3]
[null,null,{"$f":"D284-H284/3600/24","v":"2022-05-01T08:19:36"},{"$f":"C285","v":"2022-05-01T08:22:38"},null,null,"MEA1_HV_OFF",{"$f":"VLOOKUP(G284,List!B:C,2,0)","v":182},null,null,{"$f":"VLOOKUP(G284,List!B:E,4,0)","v":"dcsm-EF_MEA1_HV_OFF"},{"$f":"VLOOKUP(G284,List!B:G,6,0)","v":10},"2022-05-01T08:14:19","0000    CALL dcsm-EF_MEA1_HV_OFF -Run",null,null,2.1064814791316167E-3,{"$f":"+C285-C284","v":2.1064814791316167E-3},1.3888888890505768E-2]
[null,null,"2022-05-01T08:22:38",{"$f":"C285+H285/3600/24","v":"2022-05-01T08:42:38"},"WOL#20",null,{"$f":"(C286-D284)*24*3600","v":1800.0000002095476},1200,null,null,null,0,"2022-05-01T08:17:21",{"$f":"\"0000    WAIT_SEC  \"&TEXT(G285,\"#0\")","v":"0000    WAIT_SEC  1800"},null,null,1.3888888890505768E-2,{"$f":"+C286-C285","v":2.0833333335758653E-2},1.0069444448163267E-2]
[null,null,{"$f":"D285+10/60/24","v":"2022-05-01T08:52:38"},{"$f":"C286+H286/3600/24","v":"2022-05-01T08:57:08"},null,"SI HV ON","HEP_HV_ON",{"$f":"VLOOKUP(G286,List!B:C,2,0)","v":270},null,null,{"$f":"VLOOKUP(G286,List!B:E,4,0)","v":"dcsm-EF_HEPE_HV_ON_OBS_START"},{"$f":"VLOOKUP(G286,List!B:G,6,0)","v":6},"2022-05-01T08:47:21",{"$f":"+\"0000    CALL \"&K286&\" -Run\"","v":"0000    CALL dcsm-EF_HEPE_HV_ON_OBS_START -Run"},null,null,3.125000002910383E-3,3.125000002910383E-3,{"$f":"+D287-D286","v":3.9814814808778465E-3}]
[null,null,{"$f":"D286","v":"2022-05-01T08:57:08"},"2022-05-01T09:02:52",null,null,"ENA_HV_ON_CNT",{"$f":"VLOOKUP(G287,List!B:C,2,0)","v":344},null,null,{"$f":"VLOOKUP(G287,List!B:E,4,0)","v":"dcsm-EF_ENA_HV_ON_CNT"},{"$f":"VLOOKUP(G287,List!B:G,6,0)","v":18},"2022-05-01T08:51:51",{"$f":"+\"0000    CALL \"&K287&\" -Run\"","v":"0000    CALL dcsm-EF_ENA_HV_ON_CNT -Run"},null,null,3.9814814808778465E-3,3.9814814808778465E-3,1.9699074073287193E-2]
[null,null,"2022-05-01T09:02:52","2022-05-01T09:31:14",null,null,"MEA1_HV_ON",{"$f":"VLOOKUP(G288,List!B:C,2,0)","v":1702},null,null,{"$f":"VLOOKUP(G288,List!B:E,4,0)","v":"dcsm-EF_MEA1_HV_ON"},{"$f":"VLOOKUP(G288,List!B:G,6,0)","v":27},"2022-05-01T08:57:35","0000    CALL dcsm-EF_MEA1_HV_ON -Run",null,null,1.9699074073287193E-2,1.9699074073287193E-2,4.8611110833007842E-4]
[null,null,"2022-05-01T09:31:14","2022-05-01T09:31:56",null,"TLM mode change (MODE_5)","TLM_MODE_5",{"$f":"VLOOKUP(G289,List!B:C,2,0)","v":42},null,null,{"$f":"VLOOKUP(G289,List!B:E,4,0)","v":"dcsm-EF_BUS_TLM_MODE_5"},{"$f":"VLOOKUP(G289,List!B:G,6,0)","v":2},"2022-05-01T09:25:57","0000    CALL dcsm-EF_BUS_TLM_MODE_5 -Run",null,null,4.8611110833007842E-4,4.8611110833007842E-4,1.0332407407477149]
[null,null,"2022-05-01T09:31:56",{"$f":"C291","v":"2022-05-02T10:19:48"},"Observation W",null,null,{"$f":"(D290-C290)*3600*24","v":89272.000000602566},{"$f":"H290/3600","v":24.797777777945157},null,null,0,"2022-05-01T09:26:39",{"$f":"\"0000    WAIT_SEC  \"&TEXT(H290,\"#0\")","v":"0000    WAIT_SEC  89272"},null,null,1.0332407407477149,1.0332407407477149,4.8611110833007842E-4]
[null,null,{"$f":"D291-H291/3600/24","v":"2022-05-02T10:19:48"},{"$f":"C292","v":"2022-05-02T10:20:30"},null,"TLM mode change (MODE_10)","TLM_MODE_10",{"$f":"VLOOKUP(G291,List!B:C,2,0)","v":42},null,null,{"$f":"VLOOKUP(G291,List!B:E,4,0)","v":"dcsm-EF_BUS_TLM_MODE_10"},{"$f":"VLOOKUP(G291,List!B:G,6,0)","v":2},"2022-05-02T10:14:31",{"$f":"+\"0000    CALL \"&K291&\" -Run\"","v":"0000    CALL dcsm-EF_BUS_TLM_MODE_10 -Run"},null,null,4.8611110833007842E-4,4.8611110833007842E-4,2.1990740715409629E-3]
[null,null,{"$f":"D292-H292/3600/24","v":"2022-05-02T10:20:30"},{"$f":"C293","v":"2022-05-02T10:23:40"},null,"SI HV OFF","HEP_HV_OFF",{"$f":"VLOOKUP(G292,List!B:C,2,0)","v":190},null,null,{"$f":"VLOOKUP(G292,List!B:E,4,0)","v":"dcsm-EF_HEPE_HV_OFF_OBS_OFF"},{"$f":"VLOOKUP(G292,List!B:G,6,0)","v":5},"2022-05-02T10:15:13","0000    CALL dcsm-EF_HEPE_HV_OFF_OBS_OFF -Run",null,null,2.1990740715409629E-3,2.1990740715409629E-3,2.2916666639503092E-3]
[null,null,{"$f":"D293-H293/3600/24","v":"2022-05-02T10:23:40"},{"$f":"C294","v":"2022-05-02T10:26:58"},null,null,"ENA_HV_OFF",{"$f":"VLOOKUP(G293,List!B:C,2,0)","v":198},null,null,{"$f":"VLOOKUP(G293,List!B:E,4,0)","v":"dcsm-EF_ENA_HV_OFF"},{"$f":"VLOOKUP(G293,List!B:G,6,0)","v":4},"2022-05-02T10:18:23","0000    CALL dcsm-EF_ENA_HV_OFF -Run",null,null,2.2916666639503092E-3,2.2916666639503092E-3,2.1064814791316167E-3]
[null,null,{"$f":"D294-H294/3600/24","v":"2022-05-02T10:26:58"},{"$f":"C295","v":"2022-05-02T10:30:00"},null,null,"MEA1_HV_OFF",{"$f":"VLOOKUP(G294,List!B:C,2,0)","v":182},null,null,{"$f":"VLOOKUP(G294,List!B:E,4,0)","v":"dcsm-EF_MEA1_HV_OFF"},{"$f":"VLOOKUP(G294,List!B:G,6,0)","v":10},"2022-05-02T10:21:41","0000    CALL dcsm-EF_MEA1_HV_OFF -Run",null,null,2.1064814791316167E-3,2.1064814791316167E-3,1.3888888890505768E-2]
[null,null,"2022-05-02T10:30:00",{"$f":"C295+H295/3600/24","v":"2022-05-02T10:50:00"},"WOL#21",null,{"$f":"(C296-D294)*24*3600","v":1800.0000002095476},1200,null,null,null,0,"2022-05-02T10:24:43",{"$f":"\"0000    WAIT_SEC  \"&TEXT(G295,\"#0\")","v":"0000    WAIT_SEC  1800"},null,null,1.3888888890505768E-2,2.0833333335758653E-2,1.0069444448163267E-2]
[null,null,{"$f":"D295+10/60/24","v":"2022-05-02T11:00:00"},{"$f":"C296+H296/3600/24","v":"2022-05-02T11:04:30"},null,"SI HV ON","HEP_HV_ON",{"$f":"VLOOKUP(G296,List!B:C,2,0)","v":270},null,null,{"$f":"VLOOKUP(G296,List!B:E,4,0)","v":"dcsm-EF_HEPE_HV_ON_OBS_START"},{"$f":"VLOOKUP(G296,List!B:G,6,0)","v":6},"2022-05-02T10:54:43",{"$f":"+\"0000    CALL \"&K296&\" -Run\"","v":"0000    CALL dcsm-EF_HEPE_HV_ON_OBS_START -Run"},null,null,3.125000002910383E-3,3.125000002910383E-3,3.9814814808778465E-3]
[null,null,{"$f":"D296","v":"2022-05-02T11:04:30"},"2022-05-02T11:10:14",null,null,"ENA_HV_ON_CNT",{"$f":"VLOOKUP(G297,List!B:C,2,0)","v":344},null,null,{"$f":"VLOOKUP(G297,List!B:E,4,0)","v":"dcsm-EF_ENA_HV_ON_CNT"},{"$f":"VLOOKUP(G297,List!B:G,6,0)","v":18},"2022-05-02T10:59:13",{"$f":"+\"0000    CALL \"&K297&\" -Run\"","v":"0000    CALL dcsm-EF_ENA_HV_ON_CNT -Run"},null,null,3.9814814808778465E-3,3.9814814808778465E-3,1.9699074073287193E-2]
[null,null,"2022-05-02T11:10:14","2022-05-02T11:38:36",null,null,"MEA1_HV_ON",{"$f":"VLOOKUP(G298,List!B:C,2,0)","v":1702},null,null,{"$f":"VLOOKUP(G298,List!B:E,4,0)","v":"dcsm-EF_MEA1_HV_ON"},{"$f":"VLOOKUP(G298,List!B:G,6,0)","v":27},"2022-05-02T11:04:57","0000    CALL dcsm-EF_MEA1_HV_ON -Run",null,null,1.9699074073287193E-2,1.9699074073287193E-2,4.8611110833007842E-4]
[null,null,"2022-05-02T11:38:36","2022-05-02T11:39:18",null,"TLM mode change (MODE_5)","TLM_MODE_5",{"$f":"VLOOKUP(G299,List!B:C,2,0)","v":42},null,null,{"$f":"VLOOKUP(G299,List!B:E,4,0)","v":"dcsm-EF_BUS_TLM_MODE_5"},{"$f":"VLOOKUP(G299,List!B:G,6,0)","v":2},"2022-05-02T11:33:19","0000    CALL dcsm-EF_BUS_TLM_MODE_5 -Run",null,null,4.8611110833007842E-4,4.8611110833007842E-4,0.80590277778537711]
[null,null,"2022-05-02T11:39:18",{"$f":"C301","v":"2022-05-03T06:59:48"},"Observation X",null,null,{"$f":"(D300-C300)*3600*24","v":69630.000000656582},{"$f":"H300/3600","v":19.341666666849051},null,null,0,"2022-05-02T11:34:01",{"$f":"\"0000    WAIT_SEC  \"&TEXT(H300,\"#0\")","v":"0000    WAIT_SEC  69630"},null,null,0.80590277778537711,0.80590277778537711,4.8611110833007842E-4]
[null,null,{"$f":"D301-H301/3600/24","v":"2022-05-03T06:59:48"},{"$f":"C302","v":"2022-05-03T07:00:30"},null,"TLM mode change (MODE_10)","TLM_MODE_10",{"$f":"VLOOKUP(G301,List!B:C,2,0)","v":42},null,null,{"$f":"VLOOKUP(G301,List!B:E,4,0)","v":"dcsm-EF_BUS_TLM_MODE_10"},{"$f":"VLOOKUP(G301,List!B:G,6,0)","v":2},"2022-05-03T06:54:31",{"$f":"+\"0000    CALL \"&K301&\" -Run\"","v":"0000    CALL dcsm-EF_BUS_TLM_MODE_10 -Run"},null,null,4.8611110833007842E-4,4.8611110833007842E-4,2.1990740715409629E-3]
[null,null,{"$f":"D302-H302/3600/24","v":"2022-05-03T07:00:30"},{"$f":"C303","v":"2022-05-03T07:03:40"},null,"SI HV OFF","HEP_HV_OFF",{"$f":"VLOOKUP(G302,List!B:C,2,0)","v":190},null,null,{"$f":"VLOOKUP(G302,List!B:E,4,0)","v":"dcsm-EF_HEPE_HV_OFF_OBS_OFF"},{"$f":"VLOOKUP(G302,List!B:G,6,0)","v":5},"2022-05-03T06:55:13","0000    CALL dcsm-EF_HEPE_HV_OFF_OBS_OFF -Run",null,null,2.1990740715409629E-3,2.1990740715409629E-3,2.2916666639503092E-3]
[null,null,{"$f":"D303-H303/3600/24","v":"2022-05-03T07:03:40"},{"$f":"C304","v":"2022-05-03T07:06:58"},null,null,"ENA_HV_OFF",{"$f":"VLOOKUP(G303,List!B:C,2,0)","v":198},null,null,{"$f":"VLOOKUP(G303,List!B:E,4,0)","v":"dcsm-EF_ENA_HV_OFF"},{"$f":"VLOOKUP(G303,List!B:G,6,0)","v":4},"2022-05-03T06:58:23","0000    CALL dcsm-EF_ENA_HV_OFF -Run",null,null,2.2916666639503092E-3,2.2916666639503092E-3,2.1064814791316167E-3]
[null,null,{"$f":"D304-H304/3600/24","v":"2022-05-03T07:06:58"},{"$f":"C305","v":"2022-05-03T07:10:00"},null,null,"MEA1_HV_OFF",{"$f":"VLOOKUP(G304,List!B:C,2,0)","v":182},null,null,{"$f":"VLOOKUP(G304,List!B:E,4,0)","v":"dcsm-EF_MEA1_HV_OFF"},{"$f":"VLOOKUP(G304,List!B:G,6,0)","v":10},"2022-05-03T07:01:41","0000    CALL dcsm-EF_MEA1_HV_OFF -Run",null,null,2.1064814791316167E-3,2.1064814791316167E-3,1.3888888890505768E-2]
[null,null,"2022-05-03T07:10:00",{"$f":"C305+H305/3600/24","v":"2022-05-03T07:30:00"},"WOL#22",null,{"$f":"(C306-D304)*24*3600","v":1800.0000002095476},1200,null,null,null,0,"2022-05-03T07:04:43",{"$f":"\"0000    WAIT_SEC  \"&TEXT(G305,\"#0\")","v":"0000    WAIT_SEC  1800"},null,null,1.3888888890505768E-2,2.0833333335758653E-2,1.0069444448163267E-2]
[null,null,{"$f":"D305+10/60/24","v":"2022-05-03T07:40:00"},{"$f":"C306+H306/3600/24","v":"2022-05-03T07:44:30"},null,"SI HV ON","HEP_HV_ON",{"$f":"VLOOKUP(G306,List!B:C,2,0)","v":270},null,null,{"$f":"VLOOKUP(G306,List!B:E,4,0)","v":"dcsm-EF_HEPE_HV_ON_OBS_START"},{"$f":"VLOOKUP(G306,List!B:G,6,0)","v":6},"2022-05-03T07:34:43",{"$f":"+\"0000    CALL \"&K306&\" -Run\"","v":"0000    CALL dcsm-EF_HEPE_HV_ON_OBS_START -Run"},null,null,3.125000002910383E-3,3.125000002910383E-3,3.9814814808778465E-3]
[null,null,{"$f":"D306","v":"2022-05-03T07:44:30"},"2022-05-03T07:50:14",null,null,"ENA_HV_ON_CNT",{"$f":"VLOOKUP(G307,List!B:C,2,0)","v":344},null,null,{"$f":"VLOOKUP(G307,List!B:E,4,0)","v":"dcsm-EF_ENA_HV_ON_CNT"},{"$f":"VLOOKUP(G307,List!B:G,6,0)","v":18},"2022-05-03T07:39:13",{"$f":"+\"0000    CALL \"&K307&\" -Run\"","v":"0000    CALL dcsm-EF_ENA_HV_ON_CNT -Run"},null,null,3.9814814808778465E-3,3.9814814808778465E-3,1.9699074073287193E-2]
[null,null,"2022-05-03T07:50:14","2022-05-03T08:18:36",null,null,"MEA1_HV_ON",{"$f":"VLOOKUP(G308,List!B:C,2,0)","v":1702},null,null,{"$f":"VLOOKUP(G308,List!B:E,4,0)","v":"dcsm-EF_MEA1_HV_ON"},{"$f":"VLOOKUP(G308,List!B:G,6,0)","v":27},"2022-05-03T07:44:57","0000    CALL dcsm-EF_MEA1_HV_ON -Run",null,null,1.9699074073287193E-2,1.9699074073287193E-2,4.8611110833007842E-4]
[null,null,"2022-05-03T08:18:36","2022-05-03T08:19:18",null,"TLM mode change (MODE_5)","TLM_MODE_5",{"$f":"VLOOKUP(G309,List!B:C,2,0)","v":42},null,null,{"$f":"VLOOKUP(G309,List!B:E,4,0)","v":"dcsm-EF_BUS_TLM_MODE_5"},{"$f":"VLOOKUP(G309,List!B:G,6,0)","v":2},"2022-05-03T08:13:19","0000    CALL dcsm-EF_BUS_TLM_MODE_5 -Run",null,null,4.8611110833007842E-4,4.8611110833007842E-4,1.0767361111211358]
[null,null,"2022-05-03T08:19:18",{"$f":"C311","v":"2022-05-04T10:09:48"},"Observation Y",null,null,{"$f":"(D310-C310)*3600*24","v":93030.00000086613},{"$f":"H310/3600","v":25.841666666907258},null,null,0,"2022-05-03T08:14:01",{"$f":"\"0000    WAIT_SEC  \"&TEXT(H310,\"#0\")","v":"0000    WAIT_SEC  93030"},null,null,1.0767361111211358,1.0767361111211358,4.8611110833007842E-4]
[null,null,{"$f":"D311-H311/3600/24","v":"2022-05-04T10:09:48"},{"$f":"C312","v":"2022-05-04T10:10:30"},null,"TLM mode change (MODE_10)","TLM_MODE_10",{"$f":"VLOOKUP(G311,List!B:C,2,0)","v":42},null,null,{"$f":"VLOOKUP(G311,List!B:E,4,0)","v":"dcsm-EF_BUS_TLM_MODE_10"},{"$f":"VLOOKUP(G311,List!B:G,6,0)","v":2},"2022-05-04T10:04:31",{"$f":"+\"0000    CALL \"&K311&\" -Run\"","v":"0000    CALL dcsm-EF_BUS_TLM_MODE_10 -Run"},null,null,4.8611110833007842E-4,4.8611110833007842E-4,2.1990740715409629E-3]
[null,null,{"$f":"D312-H312/3600/24","v":"2022-05-04T10:10:30"},{"$f":"C313","v":"2022-05-04T10:13:40"},null,"SI HV OFF","HEP_HV_OFF",{"$f":"VLOOKUP(G312,List!B:C,2,0)","v":190},null,null,{"$f":"VLOOKUP(G312,List!B:E,4,0)","v":"dcsm-EF_HEPE_HV_OFF_OBS_OFF"},{"$f":"VLOOKUP(G312,List!B:G,6,0)","v":5},"2022-05-04T10:05:13","0000    CALL dcsm-EF_HEPE_HV_OFF_OBS_OFF -Run",null,null,2.1990740715409629E-3,2.1990740715409629E-3,2.2916666639503092E-3]
[null,null,{"$f":"D313-H313/3600/24","v":"2022-05-04T10:13:40"},{"$f":"C314","v":"2022-05-04T10:16:58"},null,null,"ENA_HV_OFF",{"$f":"VLOOKUP(G313,List!B:C,2,0)","v":198},null,null,{"$f":"VLOOKUP(G313,List!B:E,4,0)","v":"dcsm-EF_ENA_HV_OFF"},{"$f":"VLOOKUP(G313,List!B:G,6,0)","v":4},"2022-05-04T10:08:23","0000    CALL dcsm-EF_ENA_HV_OFF -Run",null,null,2.2916666639503092E-3,2.2916666639503092E-3,2.1064814791316167E-3]
[null,null,{"$f":"D314-H314/3600/24","v":"2022-05-04T10:16:58"},{"$f":"C315","v":"2022-05-04T10:20:00"},null,null,"MEA1_HV_OFF",{"$f":"VLOOKUP(G314,List!B:C,2,0)","v":182},null,null,{"$f":"VLOOKUP(G314,List!B:E,4,0)","v":"dcsm-EF_MEA1_HV_OFF"},{"$f":"VLOOKUP(G314,List!B:G,6,0)","v":10},"2022-05-04T10:11:41","0000    CALL dcsm-EF_MEA1_HV_OFF -Run",null,null,2.1064814791316167E-3,2.1064814791316167E-3,1.3888888890505768E-2]
[null,null,"2022-05-04T10:20:00",{"$f":"C315+H315/3600/24","v":"2022-05-04T10:40:00"},"WOL#23",null,{"$f":"(C316-D314)*24*3600","v":1800.0000002095476},1200,null,null,null,0,"2022-05-04T10:14:43",{"$f":"\"0000    WAIT_SEC  \"&TEXT(G315,\"#0\")","v":"0000    WAIT_SEC  1800"},null,null,1.3888888890505768E-2,2.0833333335758653E-2,1.0069444448163267E-2]
[null,null,{"$f":"D315+10/60/24","v":"2022-05-04T10:50:00"},{"$f":"C316+H316/3600/24","v":"2022-05-04T10:54:30"},null,"SI HV ON","HEP_HV_ON",{"$f":"VLOOKUP(G316,List!B:C,2,0)","v":270},null,null,{"$f":"VLOOKUP(G316,List!B:E,4,0)","v":"dcsm-EF_HEPE_HV_ON_OBS_START"},{"$f":"VLOOKUP(G316,List!B:G,6,0)","v":6},"2022-05-04T10:44:43",{"$f":"+\"0000    CALL \"&K316&\" -Run\"","v":"0000    CALL dcsm-EF_HEPE_HV_ON_OBS_START -Run"},null,null,3.125000002910383E-3,3.125000002910383E-3,3.9814814808778465E-3]
[null,null,{"$f":"D316","v":"2022-05-04T10:54:30"},"2022-05-04T11:00:14",null,null,"ENA_HV_ON_CNT",{"$f":"VLOOKUP(G317,List!B:C,2,0)","v":344},null,null,{"$f":"VLOOKUP(G317,List!B:E,4,0)","v":"dcsm-EF_ENA_HV_ON_CNT"},{"$f":"VLOOKUP(G317,List!B:G,6,0)","v":18},"2022-05-04T10:49:13",{"$f":"+\"0000    CALL \"&K317&\" -Run\"","v":"0000    CALL dcsm-EF_ENA_HV_ON_CNT -Run"},null,null,3.9814814808778465E-3,3.9814814808778465E-3,1.9699074073287193E-2]
[null,null,"2022-05-04T11:00:14","2022-05-04T11:28:36",null,null,"MEA1_HV_ON",{"$f":"VLOOKUP(G318,List!B:C,2,0)","v":1702},null,null,{"$f":"VLOOKUP(G318,List!B:E,4,0)","v":"dcsm-EF_MEA1_HV_ON"},{"$f":"VLOOKUP(G318,List!B:G,6,0)","v":27},"2022-05-04T10:54:57","0000    CALL dcsm-EF_MEA1_HV_ON -Run",null,null,1.9699074073287193E-2,1.9699074073287193E-2,4.8611110833007842E-4]
[null,null,"2022-05-04T11:28:36","2022-05-04T11:29:18",null,"TLM mode change (MODE_5)","TLM_MODE_5",{"$f":"VLOOKUP(G319,List!B:C,2,0)","v":42},null,null,{"$f":"VLOOKUP(G319,List!B:E,4,0)","v":"dcsm-EF_BUS_TLM_MODE_5"},{"$f":"VLOOKUP(G319,List!B:G,6,0)","v":2},"2022-05-04T11:23:19","0000    CALL dcsm-EF_BUS_TLM_MODE_5 -Run",null,null,4.8611110833007842E-4,4.8611110833007842E-4,1.0429861111188075]
[null,null,"2022-05-04T11:29:18",{"$f":"C321","v":"2022-05-05T12:31:12"},"Observation Z",null,null,{"$f":"(D320-C320)*3600*24","v":90114.000000664964},{"$f":"H320/3600","v":25.031666666851379},null,null,0,"2022-05-04T11:24:01",{"$f":"\"0000    WAIT_SEC  \"&TEXT(H320,\"#0\")","v":"0000    WAIT_SEC  90114"},null,null,1.0429861111188075,1.0429861111188075,4.8611110833007842E-4]
[null,null,{"$f":"D321-H321/3600/24","v":"2022-05-05T12:31:12"},{"$f":"C322","v":"2022-05-05T12:31:54"},null,"TLM mode change (MODE_10)","TLM_MODE_10",{"$f":"VLOOKUP(G321,List!B:C,2,0)","v":42},null,null,{"$f":"VLOOKUP(G321,List!B:E,4,0)","v":"dcsm-EF_BUS_TLM_MODE_10"},{"$f":"VLOOKUP(G321,List!B:G,6,0)","v":2},"2022-05-05T12:25:55",{"$f":"+\"0000    CALL \"&K321&\" -Run\"","v":"0000    CALL dcsm-EF_BUS_TLM_MODE_10 -Run"},null,null,4.8611110833007842E-4,4.8611110833007842E-4,2.1990740715409629E-3]
[null,null,{"$f":"D322-H322/3600/24","v":"2022-05-05T12:31:54"},{"$f":"C323","v":"2022-05-05T12:35:04"},null,"SI HV OFF","HEP_HV_OFF",{"$f":"VLOOKUP(G322,List!B:C,2,0)","v":190},null,null,{"$f":"VLOOKUP(G322,List!B:E,4,0)","v":"dcsm-EF_HEPE_HV_OFF_OBS_OFF"},{"$f":"VLOOKUP(G322,List!B:G,6,0)","v":5},"2022-05-05T12:26:37","0000    CALL dcsm-EF_HEPE_HV_OFF_OBS_OFF -Run",null,null,2.1990740715409629E-3,2.1990740715409629E-3,2.2916666639503092E-3]
[null,null,{"$f":"D323-H323/3600/24","v":"2022-05-05T12:35:04"},{"$f":"C324","v":"2022-05-05T12:38:22"},null,null,"ENA_HV_OFF",{"$f":"VLOOKUP(G323,List!B:C,2,0)","v":198},null,null,{"$f":"VLOOKUP(G323,List!B:E,4,0)","v":"dcsm-EF_ENA_HV_OFF"},{"$f":"VLOOKUP(G323,List!B:G,6,0)","v":4},"2022-05-05T12:29:47","0000    CALL dcsm-EF_ENA_HV_OFF -Run",null,null,2.2916666639503092E-3,2.2916666639503092E-3,2.1064814791316167E-3]
[null,null,{"$f":"D324-H324/3600/24","v":"2022-05-05T12:38:22"},{"$f":"C325","v":"2022-05-05T12:41:24"},null,null,"MEA1_HV_OFF",{"$f":"VLOOKUP(G324,List!B:C,2,0)","v":182},null,null,{"$f":"VLOOKUP(G324,List!B:E,4,0)","v":"dcsm-EF_MEA1_HV_OFF"},{"$f":"VLOOKUP(G324,List!B:G,6,0)","v":10},"2022-05-05T12:33:05","0000    CALL dcsm-EF_MEA1_HV_OFF -Run",null,null,2.1064814791316167E-3,2.1064814791316167E-3,1.3888888890505768E-2]
[null,null,"2022-05-05T12:41:24",{"$f":"C325+H325/3600/24","v":"2022-05-05T13:01:24"},"WOL#24",null,{"$f":"(C326-D324)*24*3600","v":1800.0000002095476},1200,null,null,null,0,"2022-05-05T12:36:07",{"$f":"\"0000    WAIT_SEC  \"&TEXT(G325,\"#0\")","v":"0000    WAIT_SEC  1800"},null,null,1.3888888890505768E-2,2.0833333335758653E-2,1.0069444448163267E-2]
[null,null,{"$f":"D325+10/60/24","v":"2022-05-05T13:11:24"},{"$f":"C326+H326/3600/24","v":"2022-05-05T13:15:54"},null,"SI HV ON","HEP_HV_ON",{"$f":"VLOOKUP(G326,List!B:C,2,0)","v":270},null,null,{"$f":"VLOOKUP(G326,List!B:E,4,0)","v":"dcsm-EF_HEPE_HV_ON_OBS_START"},{"$f":"VLOOKUP(G326,List!B:G,6,0)","v":6},"2022-05-05T13:06:07",{"$f":"+\"0000    CALL \"&K326&\" -Run\"","v":"0000    CALL dcsm-EF_HEPE_HV_ON_OBS_START -Run"},null,null,3.125000002910383E-3,3.125000002910383E-3,3.9814814808778465E-3]
[null,null,{"$f":"D326","v":"2022-05-05T13:15:54"},"2022-05-05T13:21:38",null,null,"ENA_HV_ON_CNT",{"$f":"VLOOKUP(G327,List!B:C,2,0)","v":344},null,null,{"$f":"VLOOKUP(G327,List!B:E,4,0)","v":"dcsm-EF_ENA_HV_ON_CNT"},{"$f":"VLOOKUP(G327,List!B:G,6,0)","v":18},{"$f":"C327-317/3600/24","v":"2022-05-05T13:10:37"},{"$f":"+\"0000    CALL \"&K327&\" -Run\"","v":"0000    CALL dcsm-EF_ENA_HV_ON_CNT -Run"},null,null,3.9814814808778465E-3,3.9814814808778465E-3,1.9699074073287193E-2]
[null,null,"2022-05-05T13:21:38","2022-05-05T13:50:00",null,null,"MEA1_HV_ON",{"$f":"VLOOKUP(G328,List!B:C,2,0)","v":1702},null,null,{"$f":"VLOOKUP(G328,List!B:E,4,0)","v":"dcsm-EF_MEA1_HV_ON"},{"$f":"VLOOKUP(G328,List!B:G,6,0)","v":27},"2022-05-05T13:16:21","0000    CALL dcsm-EF_MEA1_HV_ON -Run",null,null,1.9699074073287193E-2,1.9699074073287193E-2,4.8611110833007842E-4]
[null,null,"2022-05-05T13:50:00","2022-05-05T13:50:42",null,"TLM mode change (MODE_5)","TLM_MODE_5",{"$f":"VLOOKUP(G329,List!B:C,2,0)","v":42},null,null,{"$f":"VLOOKUP(G329,List!B:E,4,0)","v":"dcsm-EF_BUS_TLM_MODE_5"},{"$f":"VLOOKUP(G329,List!B:G,6,0)","v":2},"2022-05-05T13:44:43","0000    CALL dcsm-EF_BUS_TLM_MODE_5 -Run",null,null,4.8611110833007842E-4,4.8611110833007842E-4,0.42413194445543922]
[null,null,"2022-05-05T13:50:42",{"$f":"C331","v":"2022-05-06T00:01:27"},"Observation AA",null,null,{"$f":"(D330-C330)*3600*24","v":36645.000000949949},{"$f":"H330/3600","v":10.179166666930541},null,null,0,"2022-05-05T13:45:25",{"$f":"\"0000    WAIT_SEC  \"&TEXT(H330,\"#0\")","v":"0000    WAIT_SEC  36645"},null,null,0.42413194445543922,0.42413194445543922,4.8611110833007842E-4]
[null,null,{"$f":"D331-H331/3600/24","v":"2022-05-06T00:01:27"},{"$f":"C332","v":"2022-05-06T00:02:09"},null,"TLM mode change (MODE_10)","TLM_MODE_10",{"$f":"VLOOKUP(G331,List!B:C,2,0)","v":42},null,null,{"$f":"VLOOKUP(G331,List!B:E,4,0)","v":"dcsm-EF_BUS_TLM_MODE_10"},{"$f":"VLOOKUP(G331,List!B:G,6,0)","v":2},"2022-05-05T23:56:10",{"$f":"+\"0000    CALL \"&K331&\" -Run\"","v":"0000    CALL dcsm-EF_BUS_TLM_MODE_10 -Run"},null,null,4.8611110833007842E-4,4.8611110833007842E-4,2.1990740715409629E-3]
[null,null,{"$f":"D332-H332/3600/24","v":"2022-05-06T00:02:09"},{"$f":"C333","v":"2022-05-06T00:05:19"},null,"SI HV OFF","HEP_HV_OFF",{"$f":"VLOOKUP(G332,List!B:C,2,0)","v":190},null,null,{"$f":"VLOOKUP(G332,List!B:E,4,0)","v":"dcsm-EF_HEPE_HV_OFF_OBS_OFF"},{"$f":"VLOOKUP(G332,List!B:G,6,0)","v":5},"2022-05-05T23:56:52","0000    CALL dcsm-EF_HEPE_HV_OFF_OBS_OFF -Run",null,null,2.1990740715409629E-3,2.1990740715409629E-3,2.2916666639503092E-3]
[null,null,{"$f":"D333-H333/3600/24","v":"2022-05-06T00:05:19"},{"$f":"C334","v":"2022-05-06T00:08:37"},null,null,"ENA_HV_OFF",{"$f":"VLOOKUP(G333,List!B:C,2,0)","v":198},null,null,{"$f":"VLOOKUP(G333,List!B:E,4,0)","v":"dcsm-EF_ENA_HV_OFF"},{"$f":"VLOOKUP(G333,List!B:G,6,0)","v":4},"2022-05-06T00:00:02","0000    CALL dcsm-EF_ENA_HV_OFF -Run",null,null,{"$f":"+D333-C333","v":2.2916666639503092E-3},{"$f":"+C334-C333","v":2.2916666639503092E-3},2.1064814791316167E-3]
[null,null,{"$f":"D334-H334/3600/24","v":"2022-05-06T00:08:37"},{"$f":"C335","v":"2022-05-06T00:11:39"},null,null,"MEA1_HV_OFF",{"$f":"VLOOKUP(G334,List!B:C,2,0)","v":182},null,null,{"$f":"VLOOKUP(G334,List!B:E,4,0)","v":"dcsm-EF_MEA1_HV_OFF"},{"$f":"VLOOKUP(G334,List!B:G,6,0)","v":10},"2022-05-06T00:03:20","0000    CALL dcsm-EF_MEA1_HV_OFF -Run",null,null,2.1064814791316167E-3,2.1064814791316167E-3,1.3888888890505768E-2]
[null,null,"2022-05-06T00:11:39",{"$f":"C335+H335/3600/24","v":"2022-05-06T00:31:39"},"WOL#25",null,{"$f":"(C336-D334)*24*3600","v":1800.0000002095476},1200,null,null,null,0,"2022-05-06T00:06:22",{"$f":"\"0000    WAIT_SEC  \"&TEXT(G335,\"#0\")","v":"0000    WAIT_SEC  1800"},null,null,1.3888888890505768E-2,2.0833333335758653E-2,1.0069444448163267E-2]
[null,null,{"$f":"D335+10/60/24","v":"2022-05-06T00:41:39"},{"$f":"C336+H336/3600/24","v":"2022-05-06T00:46:09"},null,"SI HV ON","HEP_HV_ON",{"$f":"VLOOKUP(G336,List!B:C,2,0)","v":270},null,null,{"$f":"VLOOKUP(G336,List!B:E,4,0)","v":"dcsm-EF_HEPE_HV_ON_OBS_START"},{"$f":"VLOOKUP(G336,List!B:G,6,0)","v":6},"2022-05-06T00:36:22",{"$f":"+\"0000    CALL \"&K336&\" -Run\"","v":"0000    CALL dcsm-EF_HEPE_HV_ON_OBS_START -Run"},null,null,3.125000002910383E-3,3.125000002910383E-3,3.9814814808778465E-3]
[null,null,{"$f":"D336","v":"2022-05-06T00:46:09"},"2022-05-06T00:51:53",null,null,"ENA_HV_ON_CNT",{"$f":"VLOOKUP(G337,List!B:C,2,0)","v":344},null,null,{"$f":"VLOOKUP(G337,List!B:E,4,0)","v":"dcsm-EF_ENA_HV_ON_CNT"},{"$f":"VLOOKUP(G337,List!B:G,6,0)","v":18},"2022-05-06T00:40:52",{"$f":"+\"0000    CALL \"&K337&\" -Run\"","v":"0000    CALL dcsm-EF_ENA_HV_ON_CNT -Run"},null,null,3.9814814808778465E-3,3.9814814808778465E-3,1.9699074073287193E-2]
[null,null,"2022-05-06T00:51:53","2022-05-06T01:20:15",null,null,"MEA1_HV_ON",{"$f":"VLOOKUP(G338,List!B:C,2,0)","v":1702},null,null,{"$f":"VLOOKUP(G338,List!B:E,4,0)","v":"dcsm-EF_MEA1_HV_ON"},{"$f":"VLOOKUP(G338,List!B:G,6,0)","v":27},"2022-05-06T00:46:36","0000    CALL dcsm-EF_MEA1_HV_ON -Run",null,null,1.9699074073287193E-2,1.9699074073287193E-2,4.8611110833007842E-4]
[null,null,"2022-05-06T01:20:15","2022-05-06T01:20:57",null,"TLM mode change (MODE_5)","TLM_MODE_5",{"$f":"VLOOKUP(G339,List!B:C,2,0)","v":42},null,null,{"$f":"VLOOKUP(G339,List!B:E,4,0)","v":"dcsm-EF_BUS_TLM_MODE_5"},{"$f":"VLOOKUP(G339,List!B:G,6,0)","v":2},"2022-05-06T01:14:58","0000    CALL dcsm-EF_BUS_TLM_MODE_5 -Run",null,null,4.8611110833007842E-4,{"$f":"+#REF!-C339","v":{"$error":"#REF!"}},{"$f":"+#REF!-D339","v":{"$error":"#REF!"}}]
[null,null,"2022-05-06T10:00:00",{"$f":"C340+H340/3600/24","v":"2022-05-06T10:20:00"},null,null,"END",1200,null,null,null,0,"2022-05-06T09:54:43",null,null,null,1.3888888890505768E-2,-44687.416666666664,-44687.430555555555]